{"text_format":"1","workbook":"xlsx","n_sheets":10,"sheets":["Disclaimer","CORTEC","Configurator","Master Text","BOM","Aux Units","Database","Date Drivers","Routing","Routing DB"],"not_rendered":{"charts":0,"images":0,"macros":1,"external_links":0,"defined_names":10,"comments":0,"pivot_tables":0},"unopened":[],"bounds":{"document_bytes":16777216,"sheet_cells":100000,"rows_first":2000,"rows_last":500,"rows_between":2000,"halvings":0,"cell_chars":16384,"cell_head_chars":4096},"cells_cut":0,"cells_raw":0,"read":"whole","date_system":"1900"}

{"sheet":"Disclaimer","index":0,"n_rows":6,"n_cols":2,"rows_kept":6,"cut":false,"hidden":false,"merged":[[2,1,2,9],[5,1,7,9],[3,1,4,9]]}
["THIS PRODUCT IS NOW OBSOLETE"]
[]
[null,"Our policy is one of continuous development. Accordingly the design of our products may change at any time. "]
[null,"Whilst every effort is made to produce up to date literature, this document should only be regarded as a guide and is intended for information purposes only."]
[]
[null,"Its contents do not constitute an offer for sale or advice on the application of any product referred to in it. We cannot be held responsible for any reliance on any decisions taken on its contents without specific advice."]

{"sheet":"CORTEC","index":1,"n_rows":69,"n_cols":13,"rows_kept":69,"cut":false,"hidden":false,"merged":[[3,0,3,1]]}
["THIS PRODUCT IS NOW OBSOLETE"]
["Ordering information"]
[]
["Variants Order No.     "]
["Voltage Operated Attracted Armature Auxiliary Relay with Hand & Self Reset Contacts",null,null,"MVAA12",null,1,"B",null,null,null,null,null,"C"]
["Case"]
["All MVAA12's supplied in a Size 2 case"]
[null,null," Yellow case/black cover",null,"B"]
[null,null," Blue case/grey cover",null,"J"]
[null,null," Grey case/grey cover",null,"R"]
[]
["Flagging Option"]
["All MVAA12's supplied with a Hand Reset Flag",null,null,null,null,null,"B"]
[]
["Time Function"]
["Standard Time",null,null,null,null,null,null,"A"]
["High Speed to operate in less than 10 milliseconds 1)",null,null,null,null,null,null,"C"]
["Delayed on drop off by single slug rear mounted",null,null,null,null,null,null,"G"]
["Delayed on pick up by C-R circuit - Range 46 - 50 Milliseconds",null,null,null,null,null,null,"K"]
["Delayed on pick up by C-R circuit - Range 70 - 100 Milliseconds",null,null,null,null,null,null,"L"]
{"$rows_left_out":50}
{"sheet":"Configurator","index":2,"n_rows":22,"n_cols":9,"rows_kept":22,"cut":false,"hidden":false,"merged":[[5,0,5,2],[4,1,4,2],[15,3,17,3],[14,4,20,6]]}
["THIS PRODUCT IS NOW OBSOLETE"]
["Voltage Operated Attracted Armature Auxiliary Relay with Hand & Self Reset Contacts MVAA12"]
["To enable only current variants to be offered, please specify ACTUAL or REQUIRED delivery date here"]
[null,"Format = dd/mm/yyy (where d=day, m=month, y=year)"]
[null,"1 - 4   ",null,"5","6",9,10,null,14]
["PCS     VARIANT                   MVAA12",null,null,{"$f":"$D$9","v":"R"},1,{"$f":"$D$11","v":"B"},{"$f":"$D$13","v":"A"},{"$f":"$E$15","v":"0016"},{"$f":"D22","v":"C"}]
[null,null,null,{"$f":"#REF!","v":{"$error":"#REF!"}},{"$f":"#REF!","v":{"$error":"#REF!"}},{"$f":"#REF!","v":{"$error":"#REF!"}},{"$f":"$D$13","v":"A"},{"$f":"$D$21","v":"0000"},{"$f":"VLOOKUP(Database!#REF!,Database!#REF!,3)","v":{"$error":"#REF!"}}]
["Case Size"]
["Size 2 Case",null,null,{"$f":"Database!$A$410","v":"R"}]
["Flagging Option"]
["With Hand Reset Flag",null,null,{"$f":"VLOOKUP(Database!$B$311,Database!$A$312:$C$312,3,FALSE)","v":"B"}]
["Time Function"]
[null,null,null,{"$f":"VLOOKUP(Database!$B$1,Database!$A$2:$C$10,3,FALSE)","v":"A"}]
["Required Voltage"]
[null,null,null,{"$f":"VLOOKUP(Database!$B$11,Database!$A$12:$C$16,3,FALSE)","v":"0000"},{"$f":"VLOOKUP(Database!$C$40,Database!$B$41:$C$310,2)","v":"0016"}]
["Contact Arrangement",null,null,"plus"]
[]
["Hand Reset Contacts"]
[null,null,null,{"$f":"VLOOKUP(Database!$B$22,Database!$A$23:$C$31,3,FALSE)","v":"0016"}]
["Self Reset Contacts",null,null,"plus"]
{"$rows_left_out":3}
{"sheet":"Master Text","index":3,"n_rows":51,"n_cols":3,"rows_kept":51,"cut":false,"hidden":false,"merged":[[3,0,4,2]]}
["THIS PRODUCT IS NOW OBSOLETE"]
[{"$f":"BOM!A3","v":"MVAA12R1BA0016C"}]
["SINGLE ELEMENT ATTRACTED ARMATURE AUXILIARY RELAY."]
[{"$f":"VLOOKUP(Database!F14,Database!F15:G22,2,FALSE)","v":"HAND AND SELF RESET CONTACTS WITH HAND RESET INDICATOR (SINGLE STACK ONLY)"}]
[]
["HOUSED IN A SIZE 2 CASE"]
[]
["Auxiliary Supply Voltage :"]
[{"$f":"VLOOKUP(Database!$B$11,Database!$A$12:$B$16,2)","v":"24 - 27 Vac/Vdc"}]
["Hand Reset Contacts :"]
[{"$f":"VLOOKUP(Database!$B$22,Database!$A$23:$B$31,2)","v":"4 Make"}]
["Self Reset Contacts :"]
[{"$f":"VLOOKUP(Database!$B$33,Database!$A$34:$B$38,2)","v":"2 Make"}]
[{"$f":"IF(OR(Database!$B$1=4,Database!$B$1=5,Database!$B$1=6),\"Pick Up Range :\",IF(OR(Database!$B$1=7,Database!$B$1=8),\"Drop Off Range :\",\" \"))","v":" "}]
[{"$f":"IF(Database!$B$1>3,VLOOKUP(Database!$F$27,Database!$F$28:$G$32,2,FALSE),\" \")","v":" "}]
[]
[]
[null,"Documents"]
[]
["Outline Wrapper",":",{"$f":"VLOOKUP(Database!$C$404,Database!$A$403:$B$405,2)","v":"GJ0025.SHEET.1"}]
{"$rows_left_out":32}
{"sheet":"BOM","index":4,"n_rows":237,"n_cols":15,"rows_kept":237,"cut":false,"hidden":false,"merged":[[1,1,1,7]]}
["THIS PRODUCT IS NOW OBSOLETE"]
["PCS MATERIAL MASTER","Requirements Key(s) / # of digit in model number",null,null,null,null,null,null,"Requirements Keys","Attribute Keys","NUMBER","DESCRIPTION","Qty.","Qty. Required"]
[{"$f":"CONCATENATE(\"MVAA12\",Configurator!$D$6,Configurator!$E$6,Configurator!$F$6,Configurator!$G$6,Configurator!$H$6,Configurator!$I$6)","v":"MVAA12R1BA0016C"},7,9,10,11,12,13,14]
[null,{"$f":"MID($A$3,7,1)","v":"R"},null,null,null,null,null,null,{"$f":"B4","v":"R"},"J","GJ0414103","ASSY CASE MIDOS SIZE 2 (BLUE)",1,{"$f":"IF(I4=J4,M4,\"\")","v":""}]
[null,"R",null,null,null,null,null,null,{"$f":"B5","v":"R"},"R","GJ0414103","ASSY CASE MIDOS SIZE 2",1,{"$f":"IF(I5=J5,M5,\"\")","v":1}]
[null,"R",null,{"$f":"MID($A$3,10,1)","v":"A"},null,null,null,null,{"$f":"CONCATENATE(B6,D6)","v":"RA"},"JA","GJ0428035","ASSY COVER AND RESET",1,""]
[null,"R",null,"A",null,null,null,null,{"$f":"CONCATENATE(B7,D7)","v":"RA"},"RA","GJ0428035","ASSY COVER AND RESET",1,{"$f":"IF(I7=J7,M7,\"\")","v":1}]
[null,"R",null,"A",null,null,null,null,{"$f":"CONCATENATE(B8,D8)","v":"RA"},"JG","GJ0428035","ASSY COVER AND RESET",1,""]
[null,"R",null,"A",null,null,null,null,{"$f":"CONCATENATE(B9,D9)","v":"RA"},"RG","GJ0428035","ASSY COVER AND RESET",1,{"$f":"IF(I9=J9,M9,\"\")","v":""}]
[null,{"$f":"MID($A$3,7,1)","v":"R"},null,"A",null,null,null,null,{"$f":"CONCATENATE(B10,D10)","v":"RA"},"JA","GJ0010119","ASSEMBLY MODULE SIZE 2",1,{"$f":"IF(I10=J10,M10,\"\")","v":""}]
[null,"R",null,"A",null,null,null,null,{"$f":"CONCATENATE(B11,D11)","v":"RA"},"RA","GJ0010119","ASSEMBLY MODULE SIZE 2",1,{"$f":"IF(I11=J11,M11,\"\")","v":1}]
[null,"R",null,"A",null,null,null,null,"RA","JG","GJ0010119","ASSEMBLY MODULE SIZE 2",1,""]
[null,"R",null,"A",null,null,null,null,{"$f":"CONCATENATE(B13,D13)","v":"RA"},"RG","GJ0010119","ASSEMBLY MODULE SIZE 2",1,{"$f":"IF(I13=J13,M13,\"\")","v":""}]
[null,"R",null,"A",null,null,null,null,"RA","JC","GJ0010119","ASSEMBLY MODULE SIZE 2",1,""]
[null,"R",null,"A",null,null,null,null,{"$f":"CONCATENATE(B15,D15)","v":"RA"},"RC","GJ0010119","ASSEMBLY MODULE SIZE 2",1,{"$f":"IF(I15=J15,M15,\"\")","v":""}]
[null,"R",null,"A",null,null,null,null,"RA","JL","GJ0010103","ASSY MODULE MVAA/MCAA 12 (MCAA13 AC)",1,""]
[null,"R",null,"A",null,null,null,null,{"$f":"CONCATENATE(B17,D17)","v":"RA"},"RL","GJ0010103","ASSY MODULE MVAA/MCAA 12 (MCAA13 AC)",1,{"$f":"IF(I17=J17,M17,\"\")","v":""}]
[null,"R",null,"A",null,null,null,null,"RA","JK","GJ0010103","ASSEMBLY MODULE SIZE 2 (BLUE/GREY)",1,""]
[null,"R",null,"A",null,null,null,null,{"$f":"CONCATENATE(B19,D19)","v":"RA"},"RK","GJ0010103","ASSY MODULE MVAA/MCAA 12 (MCAA13 AC)",1,{"$f":"IF(I19=J19,M19,\"\")","v":""}]
[null,"R",null,"A",null,null,null,null,"RA","JM","GJ0010103","ASSEMBLY MODULE SIZE 2 (BLUE/GREY)",1,""]
{"$rows_left_out":218}
{"sheet":"Aux Units","index":5,"n_rows":441,"n_cols":6,"rows_kept":441,"cut":false,"hidden":true,"merged":[]}
["Aux Unit",{"$f":"VLOOKUP(Database!$C$314,Database!$B$315:$C$331,2,FALSE)","v":"FB0247431"},{"$f":"VLOOKUP(B1,Database!$C$310:$D$320,2,FALSE)","v":"B"}]
["Coil",{"$f":"VLOOKUP(Database!$C$332,Database!$B$333:$C$350,2,FALSE)","v":"ZC0228018"},{"$f":"VLOOKUP(B2,Database!$C$322:$D$344,2,FALSE)","v":"A"}]
["Contacts",{"$f":"VLOOKUP(Database!$C$350,Database!$B$351:$C$402,2,FALSE)","v":"FB0315037"},{"$f":"VLOOKUP(Database!$C$350,Database!$B$345:$D$397,3,FALSE)","v":37}]
[]
["New Aux Unit.Suffix (If Req'd)->",null,{"$f":"CONCATENATE($B$1,\".   \")","v":"FB0247431.   "}]
[]
["Copy From      -------------->",null,{"$f":"C5","v":"FB0247431.   "}]
[]
[]
[]
[{"$f":"CONCATENATE($C$1,$C$2,$C$3)","v":"BA37"},{"$f":"VLOOKUP(A11,$A$14:$C$3454,2,FALSE)","v":"FB0247431.44"},{"$f":"VLOOKUP(A11,$A$14:$C$3454,3,FALSE)","v":"ASSY AUX (ZC0228018) HR-4M SR-2M"}]
[null,null,{"$f":"F13/D13","v":0.11214953271028037}]
["Lookup Table",null,"of possible units currently exist on SAP",{"$f":"COUNTA(A14:A646)","v":428},{"$f":"COUNTIF(C14:C680,\"See Below\")","v":380},{"$f":"D13-E13","v":48}]
["AA24","FB0247431.???","See Below"]
["AA34","FB0247431.09","ASSY AUX (ZC0228018) H/R-1M 1B S/R-2M 2B"]
["AA36","FB0247431.???","See Below"]
["AA42","FB0247431.???","See Below"]
["AA45","FB0247431.???","See Below"]
["AA46","FB0247431.???","See Below"]
["AA47","FB0247431.???","See Below"]
{"$rows_left_out":422}
{"sheet":"Database","index":6,"n_rows":410,"n_cols":22,"rows_kept":410,"cut":false,"hidden":true,"merged":[]}
[null,1,{"$f":"VLOOKUP(B1,A2:C10,3,FALSE)","v":"A"},"A","24 - 27 Vac/Vdc","30 - 34 Vac/Vdc","48 - 54 Vac/Vdc","110 - 125 Vac/Vdc","220 - 250 Vac/Vdc","0000","0250","0500","0750","1000","Not Required for This Relay"," "," "," ","C","C","C"]
[1,{"$f":"HLOOKUP('Date Drivers'!$B$1,'Date Drivers'!$B$2:$D$83,2)","v":"Standard Time"},{"$f":"HLOOKUP('Date Drivers'!$B$1,'Date Drivers'!$D$2:$D$83,10)","v":"A"},"C","110 - 125 Vac/Vdc"," "," "," "," ","0750","0750","0750","0750","0750","Not Required for This Relay"," "," "," ","C","C","C"]
[2,{"$f":"HLOOKUP('Date Drivers'!$B$1,'Date Drivers'!$B$2:$D$83,3)","v":"High Speed to operate in < 10 millisecs (TEMPORARILLY WITHDRAWN)"},{"$f":"HLOOKUP('Date Drivers'!$B$1,'Date Drivers'!$D$2:$D$83,11)","v":"*"},"G","24 - 27 Vac/Vdc","30 - 34 Vac/Vdc","48 - 54 Vac/Vdc","110 - 125 Vac/Vdc","220 - 250 Vac/Vdc","0000","0250","0500","0750","1000","Not Required for This Relay"," "," "," ","C","C","C"]
[3,{"$f":"HLOOKUP('Date Drivers'!$B$1,'Date Drivers'!$B$2:$D$83,4)","v":"Delayed on drop off by single slug rear mounted"},{"$f":"HLOOKUP('Date Drivers'!$B$1,'Date Drivers'!$D$2:$D$83,12)","v":"G"},"K","110 - 125 Vac/Vdc"," "," "," "," ","0750","0750","0750","0750","0750","Delayed Pick Up Range"]
[4,{"$f":"HLOOKUP('Date Drivers'!$B$1,'Date Drivers'!$B$2:$D$83,5)","v":"Delayed on pick up by C-R circuit - Range 46 - 50 milliseconds"},{"$f":"HLOOKUP('Date Drivers'!$B$1,'Date Drivers'!$D$2:$D$83,13)","v":"K"},"L","30 - 34 Vac/Vdc"," "," "," "," ","0250","0250","0250","0250","0250","Delayed Drop Off Range",null,null,{"$f":"VLOOKUP($B$11,$O$16:$U$17,4)","v":" "},{"$f":"VLOOKUP($B$11,$O$16:$U$17,5)","v":"H"},{"$f":"VLOOKUP($B$11,$O$16:$U$17,6)","v":"H"},{"$f":"VLOOKUP($B$11,$O$16:$U$17,7)","v":"H"}]
[5,{"$f":"HLOOKUP('Date Drivers'!$B$1,'Date Drivers'!$B$2:$D$83,6)","v":"Delayed on pick up by C-R circuit - Range 70 - 100 milliseconds"},{"$f":"HLOOKUP('Date Drivers'!$B$1,'Date Drivers'!$D$2:$D$83,14)","v":"L"},"M","110 - 125 Vac/Vdc"," "," "," "," ","0750","0750","0750","0750","0750","Delayed Pick Up Range"]
[6,{"$f":"HLOOKUP('Date Drivers'!$B$1,'Date Drivers'!$B$2:$D$83,7)","v":"Delayed on pick up by C-R circuit - Range 100 - 120 milliseconds"},{"$f":"HLOOKUP('Date Drivers'!$B$1,'Date Drivers'!$D$2:$D$83,15)","v":"M"},"N","110 - 125 Vac/Vdc"," "," "," "," ","0750","0750","0750","0750","0750","Delayed Pick Up Range"]
[7,{"$f":"HLOOKUP('Date Drivers'!$B$1,'Date Drivers'!$B$2:$D$83,8)","v":"Delayed on drop off by C-R circuit - Range 100 - 200 milliseconds"},{"$f":"HLOOKUP('Date Drivers'!$B$1,'Date Drivers'!$D$2:$D$83,16)","v":"N"},"P","30 - 34 Vac/Vdc"," "," "," "," ","0250","0250","0250","0250","0250","Delayed Drop Off Range"]
[8,{"$f":"HLOOKUP('Date Drivers'!$B$1,'Date Drivers'!$B$2:$D$83,9)","v":"Delayed on drop off by C-R circuit - Range 150 - 250 milliseconds"},{"$f":"HLOOKUP('Date Drivers'!$B$1,'Date Drivers'!$D$2:$D$83,17)","v":"P"},1,2]
[null,null,null,"4 Make","2 Make",null,null,null,null,null,null,null,null,null,null,null,null,null," "," "," "," "]
[null,1,{"$f":"VLOOKUP(B11,A12:C16,3,FALSE)","v":"0000"},"3 Make & 1 Break","1 Make & 1 Break",null,null,null,null,null,null,null,null,null,null,null,null,null," "," "," "," "]
[1,{"$f":"HLOOKUP('Date Drivers'!$B$1,'Date Drivers'!$B$2:$D$83,18)","v":"24 - 27 Vac/Vdc"},{"$f":"HLOOKUP('Date Drivers'!$B$1,'Date Drivers'!$B$2:$D$83,23)","v":"0000"},"2 Make & 2 Break","2 Break",null,null,null,null,null,null,null,null,null,null,null,null,null," "," "," "," "]
[2,{"$f":"HLOOKUP('Date Drivers'!$B$1,'Date Drivers'!$B$2:$D$83,19)","v":"30 - 34 Vac/Vdc"},{"$f":"HLOOKUP('Date Drivers'!$B$1,'Date Drivers'!$B$2:$D$83,24)","v":"0250"},"1 Make & 3 Break","1 Make & 1 Cut Out Contact"," "," "," "," "," "," "," "," "," "," ",null,null," ","E","E","E"]
[3,{"$f":"HLOOKUP('Date Drivers'!$B$1,'Date Drivers'!$B$2:$D$83,20)","v":"48 - 54 Vac/Vdc"},{"$f":"HLOOKUP('Date Drivers'!$B$1,'Date Drivers'!$B$2:$D$83,25)","v":"0500"},"4 Break","1 Break & 1 Cut Out Contact",{"$f":"C1","v":"A"}," "," "," "," "," "," "," "," "," ",null,null," ","D","F","F"]
[4,{"$f":"HLOOKUP('Date Drivers'!$B$1,'Date Drivers'!$B$2:$D$83,21)","v":"110 - 125 Vac/Vdc"},{"$f":"HLOOKUP('Date Drivers'!$B$1,'Date Drivers'!$B$2:$D$83,26)","v":"0750"},"3 Make & 1 Cut Out Contact"," ","A","HAND AND SELF RESET CONTACTS WITH HAND RESET INDICATOR (SINGLE STACK ONLY)",null,null,null,null,null,null," ","K"]
[5,{"$f":"HLOOKUP('Date Drivers'!$B$1,'Date Drivers'!$B$2:$D$83,22)","v":"220 - 250 Vac/Vdc"},{"$f":"HLOOKUP('Date Drivers'!$B$1,'Date Drivers'!$B$2:$D$83,27)","v":"1000"},"2 Make, 1 Break & 1 Cut Out Contact"," ","C","HAND AND SELF RESET CONTACTS WITH HAND RESET FLAG INDICATOR. HIGH SPEED RELAY TO OPERATE IN LESS THAN 10 M/SECONDS. (SINGLE STACK ONLY)"," ",null," "," "," ",null,"30-34",1,"70 - 100 M/Sec"," "," ","H","H","H"]
[null,null,null,"1 Make, 2 Break & 1 Cut Out Contact"," ","G","HAND AND SELF RESET CONTACTS WITH HAND RESET INDICATOR , WITH OR WITHOUT CUT OFF CONTACT. (SINGLE STACK ONLY)"," ",null,null,null,null,null,"110-125",2,"46 - 50 M/Sec","100 - 120 M/Sec"," ","G","G","G"]
[null,1,null,"3 Break & 1 Cut Out Contact"," ","K","HAND AND SELF RESET CONTACTS WITH HAND RESET FLAG INDICATOR, WITH OR WITHOUT CUT OFF CONTACT (SINGLE STACK ONLY) DELAYED ON PICK UP BY C-R CIRCUIT"," ",null,null,null,null,null,null,"L"]
[1,{"$f":"HLOOKUP('Date Drivers'!$B$1,'Date Drivers'!$B$2:$D$83,28)","v":"4 Hand Reset & 2 Self Reset"},{"$f":"HLOOKUP('Date Drivers'!$B$1,'Date Drivers'!$B$2:$D$83,30)","v":1},"0016","0001","L","HAND AND SELF RESET CONTACTS WITH HAND RESET FLAG INDICATOR, WITH OR WITHOUT CUT OFF CONTACT (SINGLE STACK ONLY) DELAYED ON PICK UP BY C-R CIRCUIT"," ",null,null,null,null,null,"30-34",1,"150 - 250 M/Sec"," "]
[2,{"$f":"HLOOKUP('Date Drivers'!$B$1,'Date Drivers'!$B$2:$D$83,29)","v":"2 Hand Reset & 4 Self Reset"},{"$f":"HLOOKUP('Date Drivers'!$B$1,'Date Drivers'!$B$2:$D$83,31)","v":2},"0017","0006","M","HAND AND SELF RESET CONTACTS WITH HAND RESET FLAG INDICATOR, WITH OR WITHOUT CUT OFF CONTACT (SINGLE STACK ONLY) DELAYED ON PICK UP BY C-R CIRCUIT",null,null,null,null,null,null,"110-125",2,"100 - 200 M/Sec"," "]
{"$rows_left_out":391}
{"sheet":"Date Drivers","index":7,"n_rows":70,"n_cols":4,"rows_kept":70,"cut":false,"hidden":true,"merged":[]}
["Key Date",{"$f":"IF(Configurator!$A$4=\"\",TODAY(),Configurator!$A$4)","v":"2018-10-23"}]
[null,"2003-06-11","2004-11-01","2007-09-25"]
["Time Function","Standard Time","Standard Time","Standard Time"]
[null,"High Speed to operate in less than 10 milliseconds","High Speed to operate in less than 10 milliseconds","High Speed to operate in < 10 millisecs (TEMPORARILLY WITHDRAWN)"]
[null,"Delayed on drop off by single slug rear mounted","Delayed on drop off by single slug rear mounted","Delayed on drop off by single slug rear mounted"]
[null,"Delayed on pick up by C-R circuit - Range 46 - 50 milliseconds","Delayed on pick up by C-R circuit - Range 46 - 50 milliseconds","Delayed on pick up by C-R circuit - Range 46 - 50 milliseconds"]
[null,"Delayed on pick up by C-R circuit - Range 70 - 100 milliseconds","Delayed on pick up by C-R circuit - Range 70 - 100 milliseconds","Delayed on pick up by C-R circuit - Range 70 - 100 milliseconds"]
[null,"Delayed on pick up by C-R circuit - Range 100 - 120 milliseconds","Delayed on pick up by C-R circuit - Range 100 - 120 milliseconds","Delayed on pick up by C-R circuit - Range 100 - 120 milliseconds"]
[null,"Delayed on drop off by C-R circuit - Range 100 - 200 milliseconds","Delayed on drop off by C-R circuit - Range 100 - 200 milliseconds","Delayed on drop off by C-R circuit - Range 100 - 200 milliseconds"]
[null,"Delayed on drop off by C-R circuit - Range 150 - 250 milliseconds","Delayed on drop off by C-R circuit - Range 150 - 250 milliseconds","Delayed on drop off by C-R circuit - Range 150 - 250 milliseconds"]
[null,"A","A","A"]
[null,"C","C","*"]
["Required Voltage","G","G","G"]
[null,"K","K","K"]
[null,"L","L","L"]
[null,"M","M","M"]
[null,"N","N","N"]
[null,"P","P","P"]
[null,{"$f":"VLOOKUP(Database!$C$1,Database!$D$1:$N$9,2,FALSE)","v":"24 - 27 Vac/Vdc"},{"$f":"VLOOKUP(Database!$C$1,Database!$D$1:$N$9,2,FALSE)","v":"24 - 27 Vac/Vdc"},{"$f":"VLOOKUP(Database!$C$1,Database!$D$1:$N$9,2,FALSE)","v":"24 - 27 Vac/Vdc"}]
[null,{"$f":"VLOOKUP(Database!$C$1,Database!$D$1:$N$9,3,FALSE)","v":"30 - 34 Vac/Vdc"},{"$f":"VLOOKUP(Database!$C$1,Database!$D$1:$N$9,3,FALSE)","v":"30 - 34 Vac/Vdc"},{"$f":"VLOOKUP(Database!$C$1,Database!$D$1:$N$9,3,FALSE)","v":"30 - 34 Vac/Vdc"}]
{"$rows_left_out":51}
{"sheet":"Routing","index":8,"n_rows":42,"n_cols":6,"rows_kept":42,"cut":false,"hidden":true,"merged":[]}
[]
[null,"Model No:",{"$f":"BOM!A3","v":"MVAA12R1BA0016C"}]
[null,"Ref Op Set: "]
[null,"Pre-production Ref Op. Set: "]
[null,{"$f":"VLOOKUP('Routing DB'!$B$26,'Routing DB'!$A$29:$C$38,3,FALSE)","v":{"$error":"#REF!"}}]
[]
[null,"105B","Assembly & Wire",{"$f":"VLOOKUP('Routing DB'!$G$1,'Routing DB'!$F$3:$G$93,2,FALSE)","v":{"$error":"#REF!"}},"Mins"]
[null,"105B","Product Check",6.5,"Mins","doesn't change"]
[null,"105B","Prep for Test",{"$f":"VLOOKUP('Routing DB'!$B$1,'Routing DB'!$A$4:$B$5,2,FALSE)","v":{"$error":"#N/A"}},"Mins"]
[null,"105D",{"$f":"VLOOKUP('Routing DB'!$B$26,'Routing DB'!$A$29:$D$38,4,FALSE)","v":{"$error":"#REF!"}},{"$f":"VLOOKUP('Routing DB'!$B$26,'Routing DB'!$A$29:$B$38,2,FALSE)","v":{"$error":"#REF!"}},"Mins"]
[null,"105D","Auto Test",{"$f":"VLOOKUP('Routing DB'!$B$11,'Routing DB'!$A$14:$B$24,2,FALSE)","v":2.8},"Mins"]
[null,"106B","Nameplate Printing",{"$f":"VLOOKUP('Routing DB'!$B$1,'Routing DB'!$A$8:$B$9,2,FALSE)","v":{"$error":"#N/A"}},"Mins"]
[]
["Ass&Wire"]
["4 Std Contacts",null,14.6]
["4 BBM or 4 MBB",null,16.899999999999999]
["6 Std Contacts",null,16.899999999999999]
["8 Std Contacts",null,55.2]
["1 Std & 3 BOM",null,14.6]
["3 Std & 2 BOM",null,15.8]
{"$rows_left_out":23}
{"sheet":"Routing DB","index":9,"n_rows":93,"n_cols":7,"rows_kept":93,"cut":false,"hidden":true,"merged":[]}
["Case Size",{"$f":"Configurator!$D$6","v":"R"},null,null,null,"Contact Numbering",{"$f":"Database!#REF!","v":{"$error":"#REF!"}}]
[]
["Prep for Test",null,null,null,null,"Assembly & Wire"]
["J",5.2,null,null,null,11,14.6]
["L",10.3,null,null,null,12,14.6]
[null,null,null,null,null,13,14.6]
["Nameplate Print",null,null,null,null,14,14.6]
["J",0.6,null,null,null,15,14.6]
["L",1.2,null,null,null,16,16.899999999999999]
[null,null,null,null,null,17,16.899999999999999]
["Flag Type",{"$f":"Configurator!$F$6","v":"B"},null,null,null,31,16.899999999999999]
[null,null,null,null,null,32,16.899999999999999]
["Auto Test",null,null,null,null,33,16.899999999999999]
["A",1.9,null,null,null,34,16.899999999999999]
["B",2.8,null,null,null,35,16.899999999999999]
["C",2.8,null,null,null,36,16.899999999999999]
["D",2.8,null,null,null,37,16.899999999999999]
["E",2.8,null,null,null,51,59.8]
["F",2.8,null,null,null,53,55.2]
["J",1.9,null,null,null,54,55.2]
{"$rows_left_out":73}