{"text_format":"1","workbook":"xlsx","n_sheets":10,"sheets":["Disclaimer","CORTEC","Configurator","Master Text","BOM","Aux Units","Database","Date Drivers","Routing","Routing DB"],"not_rendered":{"charts":0,"images":0,"macros":1,"external_links":0,"defined_names":10,"comments":0,"pivot_tables":0},"unopened":[],"bounds":{"document_bytes":16777216,"sheet_cells":100000,"rows_first":2000,"rows_last":500,"rows_between":2000,"halvings":0,"cell_chars":16384,"cell_head_chars":4096},"cells_cut":0,"cells_raw":0,"read":"whole","date_system":"1900"}

{"sheet":"Disclaimer","index":0,"n_rows":6,"n_cols":2,"rows_kept":6,"cut":false,"hidden":false,"merged":[[2,1,2,9],[5,1,7,9],[3,1,4,9]]}
["THIS PRODUCT IS NOW OBSOLETE"]
[]
[null,"Our policy is one of continuous development. Accordingly the design of our products may change at any time. "]
[null,"Whilst every effort is made to produce up to date literature, this document should only be regarded as a guide and is intended for information purposes only."]
[]
[null,"Its contents do not constitute an offer for sale or advice on the application of any product referred to in it. We cannot be held responsible for any reliance on any decisions taken on its contents without specific advice."]

{"sheet":"CORTEC","index":1,"n_rows":69,"n_cols":13,"rows_kept":69,"cut":false,"hidden":false,"merged":[[3,0,3,1]]}
["THIS PRODUCT IS NOW OBSOLETE"]
["Ordering information"]
[]
["Variants Order No.     "]
["Voltage Operated Attracted Armature Auxiliary Relay with Hand & Self Reset Contacts",null,null,"MVAA12",null,1,"B",null,null,null,null,null,"C"]
["Case"]
["All MVAA12's supplied in a Size 2 case"]
[null,null," Yellow case/black cover",null,"B"]
[null,null," Blue case/grey cover",null,"J"]
[null,null," Grey case/grey cover",null,"R"]
[]
["Flagging Option"]
["All MVAA12's supplied with a Hand Reset Flag",null,null,null,null,null,"B"]
[]
["Time Function"]
["Standard Time",null,null,null,null,null,null,"A"]
["High Speed to operate in less than 10 milliseconds 1)",null,null,null,null,null,null,"C"]
["Delayed on drop off by single slug rear mounted",null,null,null,null,null,null,"G"]
["Delayed on pick up by C-R circuit - Range 46 - 50 Milliseconds",null,null,null,null,null,null,"K"]
["Delayed on pick up by C-R circuit - Range 70 - 100 Milliseconds",null,null,null,null,null,null,"L"]
["Delayed on pick up by C-R circuit - Range 100 - 120 Milliseconds",null,null,null,null,null,null,"M"]
["Delayed on drop off by C-R circuit - Range 100 - 200 Milliseconds",null,null,null,null,null,null,"N"]
["Delayed on drop off by C-R circuit - Range 150 - 250 Milliseconds",null,null,null,null,null,null,"P"]
[]
[]
["Voltage & Contact Combinations"]
["Voltage Options"]
["24/27 Vac/Vdc",null,null,null,null,null,null,null,0,0,0,0]
["30/34 Vac/Vdc",null,null,null,null,null,null,null,0,2,5,0]
["48/54 Vac/Vdc",null,null,null,null,null,null,null,0,5,0,0]
["110/125 Vac/Vdc",null,null,null,null,null,null,null,0,7,5,0]
["220/250 Vac/Vdc",null,null,null,null,null,null,null,1,0,0,0]
[]
["Contact Configuration"]
[]
["4 Hand Reset Contacts + 2 Self Reset Contacts"]
["Hand Reset Contacts"]
["4 Make",null,null,null,null,null,null,null,0,0,1,6]
["3 Make + 1 Break",null,null,null,null,null,null,null,0,0,1,7]
["2 Make + 2 Break",null,null,null,null,null,null,null,0,0,1,8]
["1 Make + 3 Break",null,null,null,null,null,null,null,0,0,1,9]
["4 Break",null,null,null,null,null,null,null,0,0,2,0]
["3 Make + 1 Cut Out Contact",null,null,null,null,null,null,null,0,1,1,1]
["2 Make, 1 Break + 1 Cut Out Contact",null,null,null,null,null,null,null,0,1,1,2]
["1 Make, 2 Break + 1 Cut Out Contact",null,null,null,null,null,null,null,0,1,1,3]
["3 Break + 1 Cut Out Contact",null,null,null,null,null,null,null,0,1,1,4]
["Plus Self Reset Contacts"]
["2 Make",null,null,null,null,null,null,null,0,0,0,0]
["1 Make + 1 Break",null,null,null,null,null,null,null,0,0,0,5]
["2 Break",null,null,null,null,null,null,null,0,0,1,0]
["OR"]
["2 Hand Reset Contacts + 4 Self Reset Contacts"]
["Hand Reset Contacts"]
["2 Make",null,null,null,null,null,null,null,0,0,0,1]
["1 Make + 1 Break",null,null,null,null,null,null,null,0,0,0,6]
["2 Break",null,null,null,null,null,null,null,0,0,1,1]
["1 Make + 1 Cut Out Contact",null,null,null,null,null,null,null,0,1,0,1]
["1 Break + 1 Cut Out Contact",null,null,null,null,null,null,null,0,1,0,6]
["Plus Self Reset Contacts"]
["4 Make",null,null,null,null,null,null,null,0,0,0,0]
["3 Make + 1 Break",null,null,null,null,null,null,null,0,0,0,1]
["2 Make + 2 Break",null,null,null,null,null,null,null,0,0,0,2]
["1 Make + 3 Break",null,null,null,null,null,null,null,0,0,0,3]
["4 Break",null,null,null,null,null,null,null,0,0,0,4]
[]
["Issue"]
["Factory Defined",null,null,null,null,null,null,null,null,null,null,null,"C"]
[]
["Note 1) : High speed option temporarily withdrawn pending further investigations"]

{"sheet":"Configurator","index":2,"n_rows":22,"n_cols":9,"rows_kept":22,"cut":false,"hidden":false,"merged":[[5,0,5,2],[4,1,4,2],[15,3,17,3],[14,4,20,6]]}
["THIS PRODUCT IS NOW OBSOLETE"]
["Voltage Operated Attracted Armature Auxiliary Relay with Hand & Self Reset Contacts MVAA12"]
["To enable only current variants to be offered, please specify ACTUAL or REQUIRED delivery date here"]
[null,"Format = dd/mm/yyy (where d=day, m=month, y=year)"]
[null,"1 - 4   ",null,"5","6",9,10,null,14]
["PCS     VARIANT                   MVAA12",null,null,{"$f":"$D$9","v":"R"},1,{"$f":"$D$11","v":"B"},{"$f":"$D$13","v":"A"},{"$f":"$E$15","v":"0016"},{"$f":"D22","v":"C"}]
[null,null,null,{"$f":"#REF!","v":{"$error":"#REF!"}},{"$f":"#REF!","v":{"$error":"#REF!"}},{"$f":"#REF!","v":{"$error":"#REF!"}},{"$f":"$D$13","v":"A"},{"$f":"$D$21","v":"0000"},{"$f":"VLOOKUP(Database!#REF!,Database!#REF!,3)","v":{"$error":"#REF!"}}]
["Case Size"]
["Size 2 Case",null,null,{"$f":"Database!$A$410","v":"R"}]
["Flagging Option"]
["With Hand Reset Flag",null,null,{"$f":"VLOOKUP(Database!$B$311,Database!$A$312:$C$312,3,FALSE)","v":"B"}]
["Time Function"]
[null,null,null,{"$f":"VLOOKUP(Database!$B$1,Database!$A$2:$C$10,3,FALSE)","v":"A"}]
["Required Voltage"]
[null,null,null,{"$f":"VLOOKUP(Database!$B$11,Database!$A$12:$C$16,3,FALSE)","v":"0000"},{"$f":"VLOOKUP(Database!$C$40,Database!$B$41:$C$310,2)","v":"0016"}]
["Contact Arrangement",null,null,"plus"]
[]
["Hand Reset Contacts"]
[null,null,null,{"$f":"VLOOKUP(Database!$B$22,Database!$A$23:$C$31,3,FALSE)","v":"0016"}]
["Self Reset Contacts",null,null,"plus"]
[{"$f":"'Date Drivers'!$D$66","v":" "},null,null,{"$f":"VLOOKUP(Database!$B$33,Database!$A$34:$C$38,3,FALSE)","v":"0000"}]
["Issue",null,null,{"$f":"HLOOKUP('Date Drivers'!$B$1,'Date Drivers'!$B$2:$D$83,62)","v":"C"}]

{"sheet":"Master Text","index":3,"n_rows":51,"n_cols":3,"rows_kept":51,"cut":false,"hidden":false,"merged":[[3,0,4,2]]}
["THIS PRODUCT IS NOW OBSOLETE"]
[{"$f":"BOM!A3","v":"MVAA12R1BA0016C"}]
["SINGLE ELEMENT ATTRACTED ARMATURE AUXILIARY RELAY."]
[{"$f":"VLOOKUP(Database!F14,Database!F15:G22,2,FALSE)","v":"HAND AND SELF RESET CONTACTS WITH HAND RESET INDICATOR (SINGLE STACK ONLY)"}]
[]
["HOUSED IN A SIZE 2 CASE"]
[]
["Auxiliary Supply Voltage :"]
[{"$f":"VLOOKUP(Database!$B$11,Database!$A$12:$B$16,2)","v":"24 - 27 Vac/Vdc"}]
["Hand Reset Contacts :"]
[{"$f":"VLOOKUP(Database!$B$22,Database!$A$23:$B$31,2)","v":"4 Make"}]
["Self Reset Contacts :"]
[{"$f":"VLOOKUP(Database!$B$33,Database!$A$34:$B$38,2)","v":"2 Make"}]
[{"$f":"IF(OR(Database!$B$1=4,Database!$B$1=5,Database!$B$1=6),\"Pick Up Range :\",IF(OR(Database!$B$1=7,Database!$B$1=8),\"Drop Off Range :\",\" \"))","v":" "}]
[{"$f":"IF(Database!$B$1>3,VLOOKUP(Database!$F$27,Database!$F$28:$G$32,2,FALSE),\" \")","v":" "}]
[]
[]
[null,"Documents"]
[]
["Outline Wrapper",":",{"$f":"VLOOKUP(Database!$C$404,Database!$A$403:$B$405,2)","v":"GJ0025.SHEET.1"}]
["Customer Wiring Diagram",":",{"$f":"VLOOKUP(1,BOM!$N$55:$O$164,2)","v":"01MVAA1210 SHT 1"}]
[]
[]
[]
[]
["Version :","A","Original - 11/06/2003"]
[null,"B","Master Text amended to include \"Header\", ie. Lines 5 to 8 on this sheet - 12/01/04"]
[null,"C","Database & BOM amended for Areva Livery - 02/05/07"]
[null,"D","Time Function \"C\" temporarily withdrawn per CIDs NJOH-75XDNY, NJOH-76HD82, NJOH-76RDJP and NJOH-779BYL - 25/09/07"]
[null,"E","Aux Units updated to include FB0247430.22 for variant MVAA12R1BA0772C - 29/04/08"]
[null,"F","Aux Units updated to include FB0247431.18 for variant MVAA12R1BA0511C - 13/05/08"]
[null,"G","Database corrected to add ratings 0123 & 0124,  0373 & 0374, 0623 & 0624, 0873 & 0874, 1123 & 1124 (previously missing) - 24/10/08"]
[null,"H","references to Alstom and Areva removed - 30/09/2010"]
[null,"I","Aux Units updated to include FB0247431.43 for variant MVAA12R1BN0763C - 13/12/10"]
[null,"J","Aux Units updated to include FB0247431.34 for variant MVAA12R1BA0771C and FB0247431.44 for variant MVAA12R1BA0016C - 15/02/11"]
[null,"K","Aux Units updated to include FB0247431.46 for variant MVAA12R1BA1016C - 21/03/11"]
[null,"L","Wiring Schedule & Connection Diagrams for MVAA12R1BN0763C & all 'N' time delayed variants changed to 02MVAA1216 SHT 1 & 01MVAA1216 SHT 1 (was …0*MVAA1207 SHT 1) - 22/03/11"]
[null,"M","Aux Units updated to include FB0247431.47 for variant MVAA12R1BA0522C. Aux Units worksheet updated to replace all FB0247430 units by FB0247431 in line with CID NJOH-83KCLZ - 10/02/12"]
[null,"N","Aux Units updated to include FB0247431.02 for variant MVAA12R1BA0751C - 16/03/12"]
[null,"O","Aux Units updated to include FB0247431.06 for variant MVAA12R1BA0758C - 26/03/12"]
[null,"P","Aux Units updated to include FB0247431.42 for variant MVAA12R1BA0508C - 02/07/12"]
[null,"Q","Aux Units updated to include FB0247431.10 for variant MVAA12R1BK0753C - 20/08/12"]
[null,"R","BOM correction - variants calling up final assembly GJ0010115 changed to GJ0010103 - PCB ZG0891001 requires the latter assembly - 17/10/2012"]
[null,"S","Aux Units updated to include FB0247431.34 for variant MVAA12R1BA1021 - 14/01/2013"]
[null,"T","Aux Units updated to include FB0247431.50 for variant MVAA12R1BK0863 - 07/02/2013"]
[null,"U","Aux Units updated to include FB0247431.51 for variant MVAA12R1BK0752 - 07/11/2013"]
[null,"V","Aux Units updated to include FB0247431.52 for variant MVAA12R1BA0351C - 04/02/2014"]
[null,"W","Aux Units updated to include FB0247431.53 for variant MVAA12R1BK0757C - 05/03/2015"]
[null,"X","Description updated for FB0247431.24 - 17/12/2015"]
[null,"Y","Aux Units updated to include FB0247431.57 for variant MVAA12R1BA0017C - 09/8/2015"]
[null,"Z","MVAA12 Obsoletion 01/10/2018 - CID005424, GE Publication No GER-4820"]

{"sheet":"BOM","index":4,"n_rows":237,"n_cols":15,"rows_kept":237,"cut":false,"hidden":false,"merged":[[1,1,1,7]]}
["THIS PRODUCT IS NOW OBSOLETE"]
["PCS MATERIAL MASTER","Requirements Key(s) / # of digit in model number",null,null,null,null,null,null,"Requirements Keys","Attribute Keys","NUMBER","DESCRIPTION","Qty.","Qty. Required"]
[{"$f":"CONCATENATE(\"MVAA12\",Configurator!$D$6,Configurator!$E$6,Configurator!$F$6,Configurator!$G$6,Configurator!$H$6,Configurator!$I$6)","v":"MVAA12R1BA0016C"},7,9,10,11,12,13,14]
[null,{"$f":"MID($A$3,7,1)","v":"R"},null,null,null,null,null,null,{"$f":"B4","v":"R"},"J","GJ0414103","ASSY CASE MIDOS SIZE 2 (BLUE)",1,{"$f":"IF(I4=J4,M4,\"\")","v":""}]
[null,"R",null,null,null,null,null,null,{"$f":"B5","v":"R"},"R","GJ0414103","ASSY CASE MIDOS SIZE 2",1,{"$f":"IF(I5=J5,M5,\"\")","v":1}]
[null,"R",null,{"$f":"MID($A$3,10,1)","v":"A"},null,null,null,null,{"$f":"CONCATENATE(B6,D6)","v":"RA"},"JA","GJ0428035","ASSY COVER AND RESET",1,""]
[null,"R",null,"A",null,null,null,null,{"$f":"CONCATENATE(B7,D7)","v":"RA"},"RA","GJ0428035","ASSY COVER AND RESET",1,{"$f":"IF(I7=J7,M7,\"\")","v":1}]
[null,"R",null,"A",null,null,null,null,{"$f":"CONCATENATE(B8,D8)","v":"RA"},"JG","GJ0428035","ASSY COVER AND RESET",1,""]
[null,"R",null,"A",null,null,null,null,{"$f":"CONCATENATE(B9,D9)","v":"RA"},"RG","GJ0428035","ASSY COVER AND RESET",1,{"$f":"IF(I9=J9,M9,\"\")","v":""}]
[null,{"$f":"MID($A$3,7,1)","v":"R"},null,"A",null,null,null,null,{"$f":"CONCATENATE(B10,D10)","v":"RA"},"JA","GJ0010119","ASSEMBLY MODULE SIZE 2",1,{"$f":"IF(I10=J10,M10,\"\")","v":""}]
[null,"R",null,"A",null,null,null,null,{"$f":"CONCATENATE(B11,D11)","v":"RA"},"RA","GJ0010119","ASSEMBLY MODULE SIZE 2",1,{"$f":"IF(I11=J11,M11,\"\")","v":1}]
[null,"R",null,"A",null,null,null,null,"RA","JG","GJ0010119","ASSEMBLY MODULE SIZE 2",1,""]
[null,"R",null,"A",null,null,null,null,{"$f":"CONCATENATE(B13,D13)","v":"RA"},"RG","GJ0010119","ASSEMBLY MODULE SIZE 2",1,{"$f":"IF(I13=J13,M13,\"\")","v":""}]
[null,"R",null,"A",null,null,null,null,"RA","JC","GJ0010119","ASSEMBLY MODULE SIZE 2",1,""]
[null,"R",null,"A",null,null,null,null,{"$f":"CONCATENATE(B15,D15)","v":"RA"},"RC","GJ0010119","ASSEMBLY MODULE SIZE 2",1,{"$f":"IF(I15=J15,M15,\"\")","v":""}]
[null,"R",null,"A",null,null,null,null,"RA","JL","GJ0010103","ASSY MODULE MVAA/MCAA 12 (MCAA13 AC)",1,""]
[null,"R",null,"A",null,null,null,null,{"$f":"CONCATENATE(B17,D17)","v":"RA"},"RL","GJ0010103","ASSY MODULE MVAA/MCAA 12 (MCAA13 AC)",1,{"$f":"IF(I17=J17,M17,\"\")","v":""}]
[null,"R",null,"A",null,null,null,null,"RA","JK","GJ0010103","ASSEMBLY MODULE SIZE 2 (BLUE/GREY)",1,""]
[null,"R",null,"A",null,null,null,null,{"$f":"CONCATENATE(B19,D19)","v":"RA"},"RK","GJ0010103","ASSY MODULE MVAA/MCAA 12 (MCAA13 AC)",1,{"$f":"IF(I19=J19,M19,\"\")","v":""}]
[null,"R",null,"A",null,null,null,null,"RA","JM","GJ0010103","ASSEMBLY MODULE SIZE 2 (BLUE/GREY)",1,""]
[null,"R",null,"A",null,null,null,null,{"$f":"CONCATENATE(B21,D21)","v":"RA"},"RM","GJ0010103","ASSEMBLY MODULE SIZE 2 (GREY/GREY)",1,{"$f":"IF(I21=J21,M21,\"\")","v":""}]
[null,"R",null,"A",null,null,null,null,"RA","JN","GJ0010103","ASSEMBLY MODULE SIZE 2 (BLUE/GREY)",1,""]
[null,"R",null,"A",null,null,null,null,{"$f":"CONCATENATE(B23,D23)","v":"RA"},"RN","GJ0010103","ASSEMBLY MODULE SIZE 2 (GREY/GREY)",1,{"$f":"IF(I23=J23,M23,\"\")","v":""}]
[null,"R",null,"A",null,null,null,null,"RA","JP","GJ0010103","ASSEMBLY MODULE SIZE 2 (BLUE/GREY)",1,{"$f":"IF(I24=J24,M24,\"\")","v":""}]
[null,"R",null,"A",null,null,null,null,{"$f":"CONCATENATE(B25,D25)","v":"RA"},"RP","GJ0010103","ASSEMBLY MODULE SIZE 2 (GREY/GREY)",1,{"$f":"IF(I25=J25,M25,\"\")","v":""}]
[null,{"$f":"MID($A$3,7,1)","v":"R"},null,"A",null,null,null,null,{"$f":"CONCATENATE(B26,D26)","v":"RA"},"JK","GJ0428027","ASSY COVER AND RESET",1,""]
[null,{"$f":"MID($A$3,7,1)","v":"R"},null,"A",null,null,null,null,{"$f":"CONCATENATE(B27,D27)","v":"RA"},"RK","GJ0428027","ASSY COVER AND RESET",1,{"$f":"IF(I27=J27,M27,\"\")","v":""}]
[null,{"$f":"MID($A$3,7,1)","v":"R"},null,"A",null,null,null,null,"RA","JL","GJ0428027","ASSY COVER AND RESET",1,{"$f":"IF(I28=J28,M28,\"\")","v":""}]
[null,{"$f":"MID($A$3,7,1)","v":"R"},null,"A",null,null,null,null,{"$f":"CONCATENATE(B29,D29)","v":"RA"},"RL","GJ0428027","ASSY COVER AND RESET",1,{"$f":"IF(I29=J29,M29,\"\")","v":""}]
[null,{"$f":"MID($A$3,7,1)","v":"R"},null,"A",null,null,null,null,"RA","JM","GJ0428027","ASSY COVER AND RESET",1,{"$f":"IF(I30=J30,M30,\"\")","v":""}]
[null,"R",null,"A",null,null,null,null,{"$f":"CONCATENATE(B31,D31)","v":"RA"},"RM","GJ0428027","ASSY COVER AND RESET",1,{"$f":"IF(I31=J31,M31,\"\")","v":""}]
[null,"R",null,"A",null,null,null,null,"RA","JN","GJ0428027","ASSY COVER AND RESET",1,""]
[null,"R",null,"A",null,null,null,null,{"$f":"CONCATENATE(B33,D33)","v":"RA"},"RN","GJ0428027","ASSY COVER AND RESET",1,{"$f":"IF(I33=J33,M33,\"\")","v":""}]
[null,"R",null,"A",null,null,null,null,"RA","JP","GJ0428027","ASSY COVER AND RESET",1,{"$f":"IF(I34=J34,M34,\"\")","v":""}]
[null,"R",null,"A",null,null,null,null,{"$f":"CONCATENATE(B35,D35)","v":"RA"},"RP","GJ0428027","ASSY COVER AND RESET",1,{"$f":"IF(I35=J35,M35,\"\")","v":""}]
[null,"R",null,"A",null,null,null,null,"RA","JC","GJ0428027","ASSY COVER AND RESET",1,{"$f":"IF(I36=J36,M36,\"\")","v":""}]
[null,"R",null,"A",null,null,null,null,{"$f":"CONCATENATE(B37,D37)","v":"RA"},"RC","GJ0428027","ASSY COVER AND RESET",1,{"$f":"IF(I37=J37,M37,\"\")","v":""}]
[null,null,null,null,null,null,null,null,null,null,"GJ0013003","TERMINAL BLOCK ASSY MODULE",1,1]
[null,"R",null,{"$f":"MID($A$3,10,1)","v":"A"},null,null,null,null,"RA","JA","GJ9179101","PRINTED LABEL",1,""]
[null,"R",null,"A",null,null,null,null,{"$f":"CONCATENATE(B40,D40)","v":"RA"},"RA","GJ9179101","PRINTED LABEL",1,{"$f":"IF(I40=J40,M40,\"\")","v":1}]
[null,"R",null,"A",null,null,null,null,"RA","JG","GJ9179101","PRINTED LABEL",1,""]
[null,"R",null,"A",null,null,null,null,{"$f":"CONCATENATE(B42,D42)","v":"RA"},"RG","GJ9179101","PRINTED LABEL",1,{"$f":"IF(I42=J42,M42,\"\")","v":""}]
[null,"R",null,"A",null,null,null,null,"RA","JK","GJ9179216","PRINTED LABEL",1,""]
[null,"R",null,"A",null,null,null,null,{"$f":"CONCATENATE(B44,D44)","v":"RA"},"RK","GJ9179216","PRINTED LABEL",1,{"$f":"IF(I44=J44,M44,\"\")","v":""}]
[null,"R",null,"A",null,null,null,null,"RA","JL","GJ9179216","PRINTED LABEL",1,{"$f":"IF(I45=J45,M45,\"\")","v":""}]
[null,"R",null,"A",null,null,null,null,{"$f":"CONCATENATE(B46,D46)","v":"RA"},"RL","GJ9179216","PRINTED LABEL",1,{"$f":"IF(I46=J46,M46,\"\")","v":""}]
[null,"R",null,"A",null,null,null,null,"RA","JM","GJ9179216","PRINTED LABEL",1,{"$f":"IF(I47=J47,M47,\"\")","v":""}]
[null,"R",null,"A",null,null,null,null,{"$f":"CONCATENATE(B48,D48)","v":"RA"},"RM","GJ9179216","PRINTED LABEL",1,{"$f":"IF(I48=J48,M48,\"\")","v":""}]
[null,"R",null,"A",null,null,null,null,"RA","JN","GJ9179216","PRINTED LABEL",1,""]
[null,"R",null,"A",null,null,null,null,{"$f":"CONCATENATE(B50,D50)","v":"RA"},"RN","GJ9179216","PRINTED LABEL",1,{"$f":"IF(I50=J50,M50,\"\")","v":""}]
[null,"R",null,"A",null,null,null,null,"RA","JP","GJ9179216","PRINTED LABEL",1,{"$f":"IF(I51=J51,M51,\"\")","v":""}]
[null,"R",null,"A",null,null,null,null,{"$f":"CONCATENATE(B52,D52)","v":"RA"},"RP","GJ9179216","PRINTED LABEL",1,{"$f":"IF(I52=J52,M52,\"\")","v":""}]
[null,"R",null,"A",null,null,null,null,"RA","JC","GJ9179216","PRINTED LABEL",1,{"$f":"IF(I53=J53,M53,\"\")","v":""}]
[null,"R",null,"A",null,null,null,null,{"$f":"CONCATENATE(B54,D54)","v":"RA"},"RC","GJ9179216","PRINTED LABEL",1,{"$f":"IF(I54=J54,M54,\"\")","v":""}]
[null,null,null,"A",null,{"$f":"MID($A$3,12,1)","v":"0"},null,null,{"$f":"CONCATENATE(D55,F55)","v":"A0"},"A0","02MVAA1210 SHT 1","INT WIRING DIAGRAM",1,1,"01MVAA1210 SHT 1"]
[null,null,null,{"$f":"MID($A$3,10,1)","v":"A"},null,{"$f":"MID($A$3,12,1)","v":"0"},null,null,{"$f":"CONCATENATE(D56,F56)","v":"A0"},"A2","02MVAA1210 SHT 1","INT WIRING DIAGRAM",1,"","01MVAA1210 SHT 1"]
[null,null,null,"A",null,"0",null,null,{"$f":"CONCATENATE(D57,F57)","v":"A0"},"A5","02MVAA1210 SHT 1","INT WIRING DIAGRAM",1,"","01MVAA1210 SHT 1"]
[null,null,null,"A",null,"0",null,null,{"$f":"CONCATENATE(D58,F58)","v":"A0"},"A7","02MVAA1210 SHT 1","INT WIRING DIAGRAM",1,"","01MVAA1210 SHT 1"]
[null,null,null,"A",null,"0",{"$f":"MID($A$3,13,1)","v":"1"},null,{"$f":"CONCATENATE(D59,F59,G59)","v":"A01"},"A10","02MVAA1212 SHT 1","INT WIRING DIAGRAM",1,"","01MVAA1212 SHT 1"]
[null,null,null,"A",null,"0",{"$f":"MID($A$3,13,1)","v":"1"},{"$f":"MID($A$3,14,1)","v":"6"},{"$f":"CONCATENATE(D60,F60,G60,H60)","v":"A016"},"A110","02MVAA1212 SHT 1","INT WIRING DIAGRAM",1,"","01MVAA1212 SHT 1"]
[null,null,null,"A",null,"0","1",null,{"$f":"CONCATENATE(D61,F61,G61)","v":"A01"},"A35","02MVAA1212 SHT 1","INT WIRING DIAGRAM",1,"","01MVAA1212 SHT 1"]
[null,null,null,"A",null,"0","1",{"$f":"MID($A$3,14,1)","v":"6"},{"$f":"CONCATENATE(D62,F62,G62,H62)","v":"A016"},"A360","02MVAA1212 SHT 1","INT WIRING DIAGRAM",1,"","01MVAA1212 SHT 1"]
[null,null,null,"A",null,"0","1",null,{"$f":"CONCATENATE(D63,F63,G63)","v":"A01"},"A60","02MVAA1212 SHT 1","INT WIRING DIAGRAM",1,"","01MVAA1212 SHT 1"]
[null,null,null,"A",null,"0","1",{"$f":"MID($A$3,14,1)","v":"6"},{"$f":"CONCATENATE(D64,F64,G64,H64)","v":"A016"},"A610","02MVAA1212 SHT 1","INT WIRING DIAGRAM",1,"","01MVAA1212 SHT 1"]
[null,null,null,"A",null,"0","1",null,{"$f":"CONCATENATE(D65,F65,G65)","v":"A01"},"A85","02MVAA1212 SHT 1","INT WIRING DIAGRAM",1,"","01MVAA1212 SHT 1"]
[null,null,null,"A",null,"0","1",{"$f":"MID($A$3,14,1)","v":"6"},{"$f":"CONCATENATE(D66,F66,G66,H66)","v":"A016"},"A860","02MVAA1212 SHT 1","INT WIRING DIAGRAM",1,"","01MVAA1212 SHT 1"]
[null,null,null,"A",null,"0","1","6",{"$f":"CONCATENATE(D67,F67,G67,H67)","v":"A016"},"A111","02MVAA1212 SHT 2","INT WIRING DIAGRAM",1,"","01MVAA1212 SHT 2"]
[null,null,null,"A",null,"0","1","6","A016","A112","02MVAA1212 SHT 2","INT WIRING DIAGRAM",1,"","01MVAA1212 SHT 2"]
[null,null,null,"A",null,"0","1","6","A016","A113","02MVAA1212 SHT 2","INT WIRING DIAGRAM",1,"","01MVAA1212 SHT 2"]
[null,null,null,"A",null,"0","1","6","A016","A114","02MVAA1212 SHT 2","INT WIRING DIAGRAM",1,"","01MVAA1212 SHT 2"]
[null,null,null,"A",null,"0","1","6","A016","A115","02MVAA1212 SHT 2","INT WIRING DIAGRAM",1,"","01MVAA1212 SHT 2"]
[null,null,null,"A",null,"0","1","6","A016","A116","02MVAA1212 SHT 2","INT WIRING DIAGRAM",1,"","01MVAA1212 SHT 2"]
[null,null,null,"A",null,"0","1","6","A016","A117","02MVAA1212 SHT 2","INT WIRING DIAGRAM",1,"","01MVAA1212 SHT 2"]
[null,null,null,"A",null,"0","1","6","A016","A118","02MVAA1212 SHT 2","INT WIRING DIAGRAM",1,"","01MVAA1212 SHT 2"]
[null,null,null,"A",null,"0","1","6","A016","A119","02MVAA1212 SHT 2","INT WIRING DIAGRAM",1,"","01MVAA1212 SHT 2"]
[null,null,null,"A",null,"0","1",null,{"$f":"CONCATENATE(D76,F76,G76)","v":"A01"},"A12","02MVAA1212 SHT 2","INT WIRING DIAGRAM",1,"","01MVAA1212 SHT 2"]
[null,null,null,"A",null,"0","1","6",{"$f":"CONCATENATE(D77,F77,G77,H77)","v":"A016"},"A361","02MVAA1212 SHT 2","INT WIRING DIAGRAM",1,"","01MVAA1212 SHT 2"]
[null,null,null,"A",null,"0","1","6",{"$f":"CONCATENATE(D78,F78,G78,H78)","v":"A016"},"A362","02MVAA1212 SHT 2","INT WIRING DIAGRAM",1,"","01MVAA1212 SHT 2"]
[null,null,null,"A",null,"0","1","6","A016","A363","02MVAA1212 SHT 2","INT WIRING DIAGRAM",1,"","01MVAA1212 SHT 2"]
[null,null,null,"A",null,"0","1","6","A016","A364","02MVAA1212 SHT 2","INT WIRING DIAGRAM",1,"","01MVAA1212 SHT 2"]
[null,null,null,"A",null,"0","1","6","A016","A365","02MVAA1212 SHT 2","INT WIRING DIAGRAM",1,"","01MVAA1212 SHT 2"]
[null,null,null,"A",null,"0","1","6","A016","A366","02MVAA1212 SHT 2","INT WIRING DIAGRAM",1,"","01MVAA1212 SHT 2"]
[null,null,null,"A",null,"0","1","6","A016","A367","02MVAA1212 SHT 2","INT WIRING DIAGRAM",1,"","01MVAA1212 SHT 2"]
[null,null,null,"A",null,"0","1","6","A016","A368","02MVAA1212 SHT 2","INT WIRING DIAGRAM",1,"","01MVAA1212 SHT 2"]
[null,null,null,"A",null,"0","1","6","A016","A369","02MVAA1212 SHT 2","INT WIRING DIAGRAM",1,"","01MVAA1212 SHT 2"]
[null,null,null,"A",null,"0","1",null,{"$f":"CONCATENATE(D86,F86,G86)","v":"A01"},"A37","02MVAA1212 SHT 2","INT WIRING DIAGRAM",1,"","01MVAA1212 SHT 2"]
[null,null,null,"A",null,"0","1","6",{"$f":"CONCATENATE(D87,F87,G87,H87)","v":"A016"},"A611","02MVAA1212 SHT 2","INT WIRING DIAGRAM",1,"","01MVAA1212 SHT 2"]
[null,null,null,"A",null,"0","1","6",{"$f":"CONCATENATE(D88,F88,G88,H88)","v":"A016"},"A612","02MVAA1212 SHT 2","INT WIRING DIAGRAM",1,"","01MVAA1212 SHT 2"]
[null,null,null,"A",null,"0","1","6","A016","A613","02MVAA1212 SHT 2","INT WIRING DIAGRAM",1,"","01MVAA1212 SHT 2"]
[null,null,null,"A",null,"0","1","6","A016","A614","02MVAA1212 SHT 2","INT WIRING DIAGRAM",1,"","01MVAA1212 SHT 2"]
[null,null,null,"A",null,"0","1","6","A016","A615","02MVAA1212 SHT 2","INT WIRING DIAGRAM",1,"","01MVAA1212 SHT 2"]
[null,null,null,"A",null,"0","1","6","A016","A616","02MVAA1212 SHT 2","INT WIRING DIAGRAM",1,"","01MVAA1212 SHT 2"]
[null,null,null,"A",null,"0","1","6","A016","A617","02MVAA1212 SHT 2","INT WIRING DIAGRAM",1,"","01MVAA1212 SHT 2"]
[null,null,null,"A",null,"0","1","6","A016","A618","02MVAA1212 SHT 2","INT WIRING DIAGRAM",1,"","01MVAA1212 SHT 2"]
[null,null,null,"A",null,"0","1","6","A016","A619","02MVAA1212 SHT 2","INT WIRING DIAGRAM",1,"","01MVAA1212 SHT 2"]
[null,null,null,"A",null,"0","1",null,{"$f":"CONCATENATE(D96,F96,G96)","v":"A01"},"A62","02MVAA1212 SHT 2","INT WIRING DIAGRAM",1,"","01MVAA1212 SHT 2"]
[null,null,null,"A",null,"0","1","6",{"$f":"CONCATENATE(D97,F97,G97,H97)","v":"A016"},"A861","02MVAA1212 SHT 2","INT WIRING DIAGRAM",1,"","01MVAA1212 SHT 2"]
[null,null,null,"A",null,"0","1","6",{"$f":"CONCATENATE(D98,F98,G98,H98)","v":"A016"},"A862","02MVAA1212 SHT 2","INT WIRING DIAGRAM",1,"","01MVAA1212 SHT 2"]
[null,null,null,"A",null,"0","1","6","A016","A863","02MVAA1212 SHT 2","INT WIRING DIAGRAM",1,"","01MVAA1212 SHT 2"]
[null,null,null,"A",null,"0","1","6","A016","A864","02MVAA1212 SHT 2","INT WIRING DIAGRAM",1,"","01MVAA1212 SHT 2"]
[null,null,null,"A",null,"0","1","6","A016","A865","02MVAA1212 SHT 2","INT WIRING DIAGRAM",1,"","01MVAA1212 SHT 2"]
[null,null,null,"A",null,"0","1","6","A016","A866","02MVAA1212 SHT 2","INT WIRING DIAGRAM",1,"","01MVAA1212 SHT 2"]
[null,null,null,"A",null,"0","1","6","A016","A867","02MVAA1212 SHT 2","INT WIRING DIAGRAM",1,"","01MVAA1212 SHT 2"]
[null,null,null,"A",null,"0","1","6","A016","A868","02MVAA1212 SHT 2","INT WIRING DIAGRAM",1,"","01MVAA1212 SHT 2"]
[null,null,null,"A",null,"0","1","6","A016","A869","02MVAA1212 SHT 2","INT WIRING DIAGRAM",1,"","01MVAA1212 SHT 2"]
[null,null,null,"A",null,"0","1",null,{"$f":"CONCATENATE(D106,F106,G106)","v":"A01"},"A87","02MVAA1212 SHT 2","INT WIRING DIAGRAM",1,"","01MVAA1212 SHT 2"]
[null,null,null,{"$f":"MID($A$3,10,1)","v":"A"},null,"0",null,null,{"$f":"CONCATENATE(D107,F107)","v":"A0"},"G0","02MVAA1210 SHT 1","INT WIRING DIAGRAM",1,"","01MVAA1210 SHT 1"]
[null,null,null,"A",null,"0",null,null,{"$f":"CONCATENATE(D108,F108)","v":"A0"},"G2","02MVAA1210 SHT 1","INT WIRING DIAGRAM",1,"","01MVAA1210 SHT 1"]
[null,null,null,"A",null,"0",null,null,{"$f":"CONCATENATE(D109,F109)","v":"A0"},"G5","02MVAA1210 SHT 1","INT WIRING DIAGRAM",1,{"$f":"IF(I109=J109,M109,\"\")","v":""},"01MVAA1210 SHT 1"]
[null,null,null,"A",null,"0",null,null,{"$f":"CONCATENATE(D110,F110)","v":"A0"},"G7","02MVAA1210 SHT 1","INT WIRING DIAGRAM",1,"","01MVAA1210 SHT 1"]
[null,null,null,"A",null,"0",{"$f":"MID($A$3,13,1)","v":"1"},null,{"$f":"CONCATENATE(D111,F111,G111)","v":"A01"},"G10","02MVAA1212 SHT 1","INT WIRING DIAGRAM",1,"","01MVAA1212 SHT 1"]
[null,null,null,"A",null,"0","1",{"$f":"MID($A$3,14,1)","v":"6"},{"$f":"CONCATENATE(D112,F112,G112,H112)","v":"A016"},"G110","02MVAA1212 SHT 1","INT WIRING DIAGRAM",1,"","01MVAA1212 SHT 1"]
[null,null,null,"A",null,"0","1",null,{"$f":"CONCATENATE(D113,F113,G113)","v":"A01"},"G35","02MVAA1212 SHT 1","INT WIRING DIAGRAM",1,"","01MVAA1212 SHT 1"]
[null,null,null,"A",null,"0","1",{"$f":"MID($A$3,14,1)","v":"6"},{"$f":"CONCATENATE(D114,F114,G114,H114)","v":"A016"},"G360","02MVAA1212 SHT 1","INT WIRING DIAGRAM",1,"","01MVAA1212 SHT 1"]
[null,null,null,"A",null,"0","1",null,{"$f":"CONCATENATE(D115,F115,G115)","v":"A01"},"G60","02MVAA1212 SHT 1","INT WIRING DIAGRAM",1,"","01MVAA1212 SHT 1"]
[null,null,null,"A",null,"0","1",{"$f":"MID($A$3,14,1)","v":"6"},{"$f":"CONCATENATE(D116,F116,G116,H116)","v":"A016"},"G610","02MVAA1212 SHT 1","INT WIRING DIAGRAM",1,"","01MVAA1212 SHT 1"]
[null,null,null,"A",null,"0","1",null,{"$f":"CONCATENATE(D117,F117,G117)","v":"A01"},"G85","02MVAA1212 SHT 1","INT WIRING DIAGRAM",1,"","01MVAA1212 SHT 1"]
[null,null,null,"A",null,"0","1",{"$f":"MID($A$3,14,1)","v":"6"},{"$f":"CONCATENATE(D118,F118,G118,H118)","v":"A016"},"G860","02MVAA1212 SHT 1","INT WIRING DIAGRAM",1,"","01MVAA1212 SHT 1"]
[null,null,null,"A",null,"0","1","6",{"$f":"CONCATENATE(D119,F119,G119,H119)","v":"A016"},"G111","02MVAA1212 SHT 2","INT WIRING DIAGRAM",1,"","01MVAA1212 SHT 2"]
[null,null,null,"A",null,{"$f":"MID($A$3,12,1)","v":"0"},"1","6","A016","G112","02MVAA1212 SHT 2","INT WIRING DIAGRAM",1,"","01MVAA1212 SHT 2"]
[null,null,null,"A",null,"0","1","6","A016","G113","02MVAA1212 SHT 2","INT WIRING DIAGRAM",1,"","01MVAA1212 SHT 2"]
[null,null,null,"A",null,"0","1","6","A016","G114","02MVAA1212 SHT 2","INT WIRING DIAGRAM",1,"","01MVAA1212 SHT 2"]
[null,null,null,"A",null,"0","1","6","A016","G115","02MVAA1212 SHT 2","INT WIRING DIAGRAM",1,"","01MVAA1212 SHT 2"]
[null,null,null,"A",null,"0","1","6","A016","G116","02MVAA1212 SHT 2","INT WIRING DIAGRAM",1,"","01MVAA1212 SHT 2"]
[null,null,null,"A",null,"0","1","6","A016","G117","02MVAA1212 SHT 2","INT WIRING DIAGRAM",1,"","01MVAA1212 SHT 2"]
[null,null,null,"A",null,"0","1","6","A016","G118","02MVAA1212 SHT 2","INT WIRING DIAGRAM",1,"","01MVAA1212 SHT 2"]
[null,null,null,"A",null,"0","1","6","A016","G119","02MVAA1212 SHT 2","INT WIRING DIAGRAM",1,"","01MVAA1212 SHT 2"]
[null,null,null,"A",null,"0","1",null,{"$f":"CONCATENATE(D128,F128,G128)","v":"A01"},"G12","02MVAA1212 SHT 2","INT WIRING DIAGRAM",1,"","01MVAA1212 SHT 2"]
[null,null,null,"A",null,"0","1",{"$f":"MID($A$3,14,1)","v":"6"},{"$f":"CONCATENATE(D129,F129,G129,H129)","v":"A016"},"G361","02MVAA1212 SHT 2","INT WIRING DIAGRAM",1,"","01MVAA1212 SHT 2"]
[null,null,null,"A",null,"0","1","6",{"$f":"CONCATENATE(D130,F130,G130,H130)","v":"A016"},"G362","02MVAA1212 SHT 2","INT WIRING DIAGRAM",1,"","01MVAA1212 SHT 2"]
[null,null,null,"A",null,"0","1","6","A016","G363","02MVAA1212 SHT 2","INT WIRING DIAGRAM",1,"","01MVAA1212 SHT 2"]
[null,null,null,"A",null,"0","1","6","A016","G364","02MVAA1212 SHT 2","INT WIRING DIAGRAM",1,"","01MVAA1212 SHT 2"]
[null,null,null,"A",null,"0","1","6","A016","G365","02MVAA1212 SHT 2","INT WIRING DIAGRAM",1,"","01MVAA1212 SHT 2"]
[null,null,null,"A",null,"0","1","6","A016","G366","02MVAA1212 SHT 2","INT WIRING DIAGRAM",1,"","01MVAA1212 SHT 2"]
[null,null,null,"A",null,"0","1","6","A016","G367","02MVAA1212 SHT 2","INT WIRING DIAGRAM",1,"","01MVAA1212 SHT 2"]
[null,null,null,"A",null,"0","1","6","A016","G368","02MVAA1212 SHT 2","INT WIRING DIAGRAM",1,"","01MVAA1212 SHT 2"]
[null,null,null,"A",null,"0","1","6","A016","G369","02MVAA1212 SHT 2","INT WIRING DIAGRAM",1,"","01MVAA1212 SHT 2"]
[null,null,null,"A",null,"0","1",null,{"$f":"CONCATENATE(D138,F138,G138)","v":"A01"},"G37","02MVAA1212 SHT 2","INT WIRING DIAGRAM",1,"","01MVAA1212 SHT 2"]
[null,null,null,"A",null,"0","1",{"$f":"MID($A$3,14,1)","v":"6"},{"$f":"CONCATENATE(D139,F139,G139,H139)","v":"A016"},"G611","02MVAA1212 SHT 2","INT WIRING DIAGRAM",1,"","01MVAA1212 SHT 2"]
[null,null,null,"A",null,"0","1","6",{"$f":"CONCATENATE(D140,F140,G140,H140)","v":"A016"},"G612","02MVAA1212 SHT 2","INT WIRING DIAGRAM",1,"","01MVAA1212 SHT 2"]
[null,null,null,"A",null,"0","1","6","A016","G613","02MVAA1212 SHT 2","INT WIRING DIAGRAM",1,"","01MVAA1212 SHT 2"]
[null,null,null,"A",null,"0","1","6","A016","G614","02MVAA1212 SHT 2","INT WIRING DIAGRAM",1,"","01MVAA1212 SHT 2"]
[null,null,null,"A",null,"0","1","6","A016","G615","02MVAA1212 SHT 2","INT WIRING DIAGRAM",1,"","01MVAA1212 SHT 2"]
[null,null,null,"A",null,"0","1","6","A016","G616","02MVAA1212 SHT 2","INT WIRING DIAGRAM",1,"","01MVAA1212 SHT 2"]
[null,null,null,"A",null,"0","1","6","A016","G617","02MVAA1212 SHT 2","INT WIRING DIAGRAM",1,"","01MVAA1212 SHT 2"]
[null,null,null,"A",null,"0","1","6","A016","G618","02MVAA1212 SHT 2","INT WIRING DIAGRAM",1,"","01MVAA1212 SHT 2"]
[null,null,null,"A",null,"0","1","6","A016","G619","02MVAA1212 SHT 2","INT WIRING DIAGRAM",1,"","01MVAA1212 SHT 2"]
[null,null,null,"A",null,"0","1",null,{"$f":"CONCATENATE(D148,F148,G148)","v":"A01"},"G62","02MVAA1212 SHT 2","INT WIRING DIAGRAM",1,"","01MVAA1212 SHT 2"]
[null,null,null,"A",null,"0","1",{"$f":"MID($A$3,14,1)","v":"6"},{"$f":"CONCATENATE(D149,F149,G149,H149)","v":"A016"},"G861","02MVAA1212 SHT 2","INT WIRING DIAGRAM",1,"","01MVAA1212 SHT 2"]
[null,null,null,"A",null,"0","1","6",{"$f":"CONCATENATE(D150,F150,G150,H150)","v":"A016"},"G862","02MVAA1212 SHT 2","INT WIRING DIAGRAM",1,"","01MVAA1212 SHT 2"]
[null,null,null,"A",null,"0","1","6","A016","G863","02MVAA1212 SHT 2","INT WIRING DIAGRAM",1,"","01MVAA1212 SHT 2"]
[null,null,null,"A",null,"0","1","6","A016","G864","02MVAA1212 SHT 2","INT WIRING DIAGRAM",1,"","01MVAA1212 SHT 2"]
[null,null,null,"A",null,"0","1","6","A016","G865","02MVAA1212 SHT 2","INT WIRING DIAGRAM",1,"","01MVAA1212 SHT 2"]
[null,null,null,"A",null,"0","1","6","A016","G866","02MVAA1212 SHT 2","INT WIRING DIAGRAM",1,"","01MVAA1212 SHT 2"]
[null,null,null,"A",null,"0","1","6","A016","G867","02MVAA1212 SHT 2","INT WIRING DIAGRAM",1,"","01MVAA1212 SHT 2"]
[null,null,null,"A",null,"0","1","6","A016","G868","02MVAA1212 SHT 2","INT WIRING DIAGRAM",1,"","01MVAA1212 SHT 2"]
[null,null,null,"A",null,"0","1","6","A016","G869","02MVAA1212 SHT 2","INT WIRING DIAGRAM",1,"","01MVAA1212 SHT 2"]
[null,null,null,"A",null,"0","1",null,{"$f":"CONCATENATE(D158,F158,G158)","v":"A01"},"G87","02MVAA1212 SHT 2","INT WIRING DIAGRAM",1,"","01MVAA1212 SHT 2"]
[null,null,null,"A",null,null,null,null,{"$f":"D159","v":"A"},"L","02MVAA1215 SHT 1","INT WIRING DIAGRAM",1,"","01MVAA1215 SHT 1"]
[null,null,null,"A",null,null,null,null,"A","K","02MVAA1206 SHT 1","INT WIRING DIAGRAM",1,"","01MVAA1206 SHT 1"]
[null,null,null,"A",null,null,null,null,"A","M","02MVAA1206 SHT 1","INT WIRING DIAGRAM",1,"","01MVAA1206 SHT 1"]
[null,null,null,"A",null,null,null,null,"A","P","02MVAA1205 SHT 1","INT WIRING DIAGRAM",1,"","01MVAA1205 SHT 1"]
[null,null,null,"A",null,null,null,null,"A","N","02MVAA1207 SHT 1","INT WIRING DIAGRAM",1,"","01MVAA1216 SHT 1"]
[null,null,null,"A",null,null,null,null,"A","C","02MVAA12004 SHT 1","INT WIRING DIAGRAM",1,{"$f":"IF(I164=J164,M164,\"\")","v":""},"01MVAA12004 SHT 1"]
[null,null,null,"A",null,null,null,null,{"$f":"CONCATENATE(D165,F165)","v":"A"},"L","ZB4018119","Self tapping screw Pan head Size 4 X ¼\"",2,""]
[null,null,null,"A",null,null,null,null,{"$f":"D166","v":"A"},"C","ZB4018119","Self tapping screw Pan head Size 4 X ¼\"",2,{"$f":"IF(I166=J166,M166,\"\")","v":""}]
[null,null,null,"A",null,null,null,null,{"$f":"D167","v":"A"},"C","ZB5009036","WASHER SHAKEPROOF INTERNAL M3 STEEL",6,{"$f":"IF(I167=J167,M167,\"\")","v":""}]
[null,null,null,"A",null,null,null,null,{"$f":"CONCATENATE(D168,F168)","v":"A"},"L","ZB5009036","WASHER SHAKEPROOF INTERNAL M3 STEEL",6,""]
[null,null,null,"A",null,null,null,null,{"$f":"CONCATENATE(D169,F169)","v":"A"},"L","ZB5101036","FULL NUT M3 BRASS (kan)",4,""]
[null,null,null,"A",null,null,null,null,{"$f":"D170","v":"A"},"C","ZB5101036","FULL NUT M3 BRASS (kan)",4,{"$f":"IF(I170=J170,M170,\"\")","v":""}]
[null,null,null,"A",null,null,null,null,{"$f":"D171","v":"A"},"C","ZB5326094","SCREW M3 X 8MM LG",6,{"$f":"IF(I171=J171,M171,\"\")","v":""}]
[null,null,null,"A",null,null,null,null,{"$f":"CONCATENATE(D172,F172)","v":"A"},"L","ZB5326094","SCREW M3 X 8MM LG",6,{"$f":"IF(I172=J172,M172,\"\")","v":""}]
[null,null,null,"A",null,null,null,null,{"$f":"CONCATENATE(D173,F173)","v":"A"},"L","ZE0002038","TAG STRIP",1,""]
[null,null,null,"A",null,null,null,null,{"$f":"CONCATENATE(D174,F174)","v":"A"},"K","ZE0002036","TAG STRIP MIDOS",1,""]
[null,null,null,"A",null,null,null,null,{"$f":"CONCATENATE(D175,F175)","v":"A"},"M","ZE0002036","TAG STRIP MIDOS",1,""]
[null,null,null,"A",null,null,null,null,{"$f":"D176","v":"A"},"N","ZE0002036","TAG STRIP MIDOS",1,""]
[null,null,null,"A",null,null,null,null,{"$f":"D177","v":"A"},"P","ZE0002036","TAG STRIP MIDOS",1,{"$f":"IF(I177=J177,M177,\"\")","v":""}]
[null,null,null,"A",null,null,null,null,"A","C","ZE0002036","TAG STRIP MIDOS",1,{"$f":"IF(I178=J178,M178,\"\")","v":""}]
[null,null,null,"A",null,null,null,null,"A","A","ZB4018118","SELF TAPPING SCREW SIZE 4 X 1/4\" LG",10,10]
[null,null,null,"A",null,null,null,null,"A","G","ZB4018118","SELF TAPPING SCREW SIZE 4 X 1/4\" LG",10,""]
[null,null,null,"A",null,null,null,null,"A","A","ZJ0254001","ASSY PCB - COST-IMP'D MVAA/MVAJ - A/03",1,1]
[null,null,null,"A",null,null,null,null,"A","K","ZG0891001","ASSY PCB - RECTIFIER BRIDGE - B/14",1,""]
[null,null,null,"A",null,null,null,null,{"$f":"D183","v":"A"},"L","ZG0891001","ASSY PCB - RECTIFIER BRIDGE - B/14",1,{"$f":"IF(I183=J183,M183,\"\")","v":""}]
[null,null,null,"A",null,null,null,null,{"$f":"D184","v":"A"},"M","ZG0891001","ASSY PCB - RECTIFIER BRIDGE - B/14",1,{"$f":"IF(I184=J184,M184,\"\")","v":""}]
[null,null,null,"A",null,null,null,null,"A","C","ZG0891001","ASSY PCB - RECTIFIER BRIDGE - B/14",1,{"$f":"IF(I185=J185,M185,\"\")","v":""}]
[null,null,null,"A",null,null,null,null,"A","N","ZG0891001","ASSY PCB - RECTIFIER BRIDGE - B/14",1,""]
[null,null,null,"A",null,null,null,null,{"$f":"D187","v":"A"},"P","ZG0891001","ASSY PCB - RECTIFIER BRIDGE - B/14",1,{"$f":"IF(I187=J187,M187,\"\")","v":""}]
[null,null,null,"A",null,null,null,null,"A","G","ZJ0254001","ASSY PCB - COST-IMP'D MVAA/MVAJ - A/03",1,""]
[null,null,null,"A",null,{"$f":"MID($A$3,12,1)","v":"0"},null,null,{"$f":"CONCATENATE(D189,F189)","v":"A0"},"A0","ZA0005060","ZA0005060 (20 PACK)",1,1]
[null,null,null,"A",null,"0",null,null,"A0","A2","ZA0005060","ZA0005060 (20 PACK)",1,""]
[null,null,null,"A",null,"0",null,null,"A0","A5","ZA0005060","ZA0005060 (20 PACK)",1,""]
[null,null,null,"A",null,"0",null,null,"A0","A7","ZA0005060","ZA0005060 (20 PACK)",1,""]
[null,null,null,"A",null,"0",null,null,"A0","A1","ZA0005059","ZA0005059 (12 PACK)",1,""]
[null,null,null,"A",null,"0",null,null,"A0","A3","ZA0005059","ZA0005059 (12 PACK)",1,""]
[null,null,null,"A",null,"0",null,null,"A0","A6","ZA0005059","ZA0005059 (12 PACK)",1,""]
[null,null,null,"A",null,"0",null,null,"A0","A8","ZA0005059","ZA0005059 (12 PACK)",1,""]
[null,null,null,"A",null,null,null,null,{"$f":"D197","v":"A"},"K","ZA0005060","ZA0005060 (20 PACK)",1,""]
[null,null,null,"A",null,null,null,null,"A","L","ZA0005060","ZA0005060 (20 PACK)",1,{"$f":"IF(I198=J198,M198,\"\")","v":""}]
[null,null,null,"A",null,null,null,null,"A","M","ZA0005060","ZA0005060 (20 PACK)",1,{"$f":"IF(I199=J199,M199,\"\")","v":""}]
[null,null,null,"A",null,null,null,null,"A","N","ZA0005060","ZA0005060 (20 PACK)",1,{"$f":"IF(I200=J200,M200,\"\")","v":""}]
[null,null,null,"A",null,null,null,null,"A","P","ZA0005060","ZA0005060 (20 PACK)",1,{"$f":"IF(I201=J201,M201,\"\")","v":""}]
[null,null,null,"A",null,null,null,null,"A","C","ZA0005060","ZA0005060 (20 PACK)",1,{"$f":"IF(I202=J202,M202,\"\")","v":""}]
[null,null,null,"A",null,{"$f":"MID($A$3,12,1)","v":"0"},null,null,{"$f":"CONCATENATE(D203,F203)","v":"A0"},"G0","ZA0005060","ZA0005060 (20 PACK)",1,""]
[null,null,null,"A",null,"0",null,null,{"$f":"CONCATENATE(D204,F204)","v":"A0"},"G2","ZA0005060","ZA0005060 (20 PACK)",1,""]
[null,null,null,"A",null,"0",null,null,"A0","G5","ZA0005060","ZA0005060 (20 PACK)",1,""]
[null,null,null,"A",null,"0",null,null,"A0","G7","ZA0005060","ZA0005060 (20 PACK)",1,""]
[null,null,null,"A",null,"0",null,null,"A0","G1","ZA0005059","ZA0005059 (12 PACK)",1,""]
[null,null,null,"A",null,"0",null,null,"A0","G3","ZA0005059","ZA0005059 (12 PACK)",1,""]
[null,null,null,"A",null,"0",null,null,"A0","G6","ZA0005059","ZA0005059 (12 PACK)",1,""]
[null,null,null,"A",null,"0",null,null,"A0","G8","ZA0005059","ZA0005059 (12 PACK)",1,""]
[null,null,null,null,null,null,null,null,null,null,"ZA0005106","MIDOS MTG PACK (4X)",1,1]
[null,null,null,"A",null,"0",null,null,{"$f":"CONCATENATE(D212,F212)","v":"A0"},"A1","ZB9128055","FEMALE TAB RECEPTACLE- BRASS-UNINSULATED",5,""]
[null,null,null,"A",null,"0",null,null,"A0","A3","ZB9128055","FEMALE TAB RECEPTACLE- BRASS-UNINSULATED",5,""]
[null,null,null,{"$f":"MID($A$3,10,1)","v":"A"},null,"0",null,null,"A0","A6","ZB9128055","FEMALE TAB RECEPTACLE- BRASS-UNINSULATED",5,""]
[null,null,null,"A",null,"0",null,null,"A0","A8","ZB9128055","FEMALE TAB RECEPTACLE- BRASS-UNINSULATED",5,""]
[null,null,null,"A",null,"0",null,null,"A0","G1","ZB9128055","FEMALE TAB RECEPTACLE- BRASS-UNINSULATED",5,""]
[null,null,null,"A",null,"0",null,null,"A0","G3","ZB9128055","FEMALE TAB RECEPTACLE- BRASS-UNINSULATED",5,""]
[null,null,null,"A",null,"0",null,null,"A0","G6","ZB9128055","FEMALE TAB RECEPTACLE- BRASS-UNINSULATED",5,""]
[null,null,null,"A",null,"0",null,null,"A0","G8","ZB9128055","FEMALE TAB RECEPTACLE- BRASS-UNINSULATED",5,""]
[null,null,null,"A",null,null,null,null,{"$f":"D220","v":"A"},"K","ZB9012698","RESISTOR WIREWOUND 1K-12W-5%",1,{"$f":"IF(I220=J220,M220,\"\")","v":""}]
[null,null,null,"A",null,null,null,null,{"$f":"D221","v":"A"},"K","ZB9049398","CAPACITOR ELECTROLYT 47UF-160V +30/-10%",2,{"$f":"IF(I221=J221,M221,\"\")","v":""}]
[null,null,null,"A",null,null,null,null,"A","L","ZB9012685","RESISTOR WIREWOUND 300R-12W-5%",1,""]
[null,null,null,"A",null,null,null,null,"A","L","ZB9049413","CAPACITOR ELECTROLYT 220UF-40V +50/-10%",1,""]
[null,null,null,"A",null,null,null,null,"A","M","ZB9012698","RESISTOR WIREWOUND 1K-12W-5%",1,""]
[null,null,null,"A",null,null,null,null,"A","M","ZB9049491","CAPACITOR ELECTROLYT 150UF-100V +75/-10%",2,""]
[null,null,null,"A",null,null,null,null,"A","P","ZB9012291","RESISTOR WIREWOUND 47R-6W-5%",1,""]
[null,null,null,"A",null,null,null,null,"A","P","ZB9012713","RES.WIREWOUND 4.3K-12W-5% [PLANT 1000]",1,""]
[null,null,null,"A",null,null,null,null,"A","P","ZB9049415","CAPACITOR ELECTROLYT 47UF-63V +50/-10%",2,""]
[null,null,null,"A",null,null,null,null,"A","P","ZB9451125","DIODE REFERENCE-1000V-1A- DO-204 [JZ]",1,""]
[null,null,null,"A",null,null,null,null,"A","N","ZB9012674","RESISTOR WIREWOUND 100R-12W-5%",1,{"$f":"IF(I230=J230,M230,\"\")","v":""}]
[null,null,null,"A",null,null,null,null,"A","N","ZB9058680","CAPACITOR POLYESTER 15UF-100VAC-10%",2,{"$f":"IF(I231=J231,M231,\"\")","v":""}]
[null,null,null,"A",null,null,null,null,{"$f":"D232","v":"A"},"C","ZB9012303","RESISTOR WIREWOUND 150R-6W-5%",1,{"$f":"IF(I232=J232,M232,\"\")","v":""}]
[null,null,null,"A",null,null,null,null,{"$f":"D233","v":"A"},"C","ZB9058485","CAPACITOR POLYESTER 1UF-400V-20%",1,{"$f":"IF(I233=J233,M233,\"\")","v":""}]
[null,null,null,null,null,null,null,null,null,null,{"$f":"'Aux Units'!$B$11","v":"FB0247431.44"},{"$f":"'Aux Units'!$C$11","v":"ASSY AUX (ZC0228018) HR-4M SR-2M"},1,{"$f":"IF(I234=J234,M234,\"\")","v":1}]
[null,null,null,null,null,null,null,null,null,null,"Aux Unit",{"$f":"IF($L$234=\"See Below\",'Aux Units'!B1,)","v":0},1,{"$f":"IF(L235>1,1,\"\")","v":""}]
[null,null,null,null,null,null,null,null,null,null,"Coil",{"$f":"IF($L$234=\"See Below\",'Aux Units'!B2,)","v":0},1,{"$f":"IF(L236>1,1,\"\")","v":""}]
[null,null,null,null,null,null,null,null,null,null,"Contacts",{"$f":"IF($L$234=\"See Below\",'Aux Units'!B3,)","v":0},1,{"$f":"IF(L237>1,1,\"\")","v":""}]

{"sheet":"Aux Units","index":5,"n_rows":441,"n_cols":6,"rows_kept":441,"cut":false,"hidden":true,"merged":[]}
["Aux Unit",{"$f":"VLOOKUP(Database!$C$314,Database!$B$315:$C$331,2,FALSE)","v":"FB0247431"},{"$f":"VLOOKUP(B1,Database!$C$310:$D$320,2,FALSE)","v":"B"}]
["Coil",{"$f":"VLOOKUP(Database!$C$332,Database!$B$333:$C$350,2,FALSE)","v":"ZC0228018"},{"$f":"VLOOKUP(B2,Database!$C$322:$D$344,2,FALSE)","v":"A"}]
["Contacts",{"$f":"VLOOKUP(Database!$C$350,Database!$B$351:$C$402,2,FALSE)","v":"FB0315037"},{"$f":"VLOOKUP(Database!$C$350,Database!$B$345:$D$397,3,FALSE)","v":37}]
[]
["New Aux Unit.Suffix (If Req'd)->",null,{"$f":"CONCATENATE($B$1,\".   \")","v":"FB0247431.   "}]
[]
["Copy From      -------------->",null,{"$f":"C5","v":"FB0247431.   "}]
[]
[]
[]
[{"$f":"CONCATENATE($C$1,$C$2,$C$3)","v":"BA37"},{"$f":"VLOOKUP(A11,$A$14:$C$3454,2,FALSE)","v":"FB0247431.44"},{"$f":"VLOOKUP(A11,$A$14:$C$3454,3,FALSE)","v":"ASSY AUX (ZC0228018) HR-4M SR-2M"}]
[null,null,{"$f":"F13/D13","v":0.11214953271028037}]
["Lookup Table",null,"of possible units currently exist on SAP",{"$f":"COUNTA(A14:A646)","v":428},{"$f":"COUNTIF(C14:C680,\"See Below\")","v":380},{"$f":"D13-E13","v":48}]
["AA24","FB0247431.???","See Below"]
["AA34","FB0247431.09","ASSY AUX (ZC0228018) H/R-1M 1B S/R-2M 2B"]
["AA36","FB0247431.???","See Below"]
["AA42","FB0247431.???","See Below"]
["AA45","FB0247431.???","See Below"]
["AA46","FB0247431.???","See Below"]
["AA47","FB0247431.???","See Below"]
["AA48","FB0247431.???","See Below"]
["AA49","FB0247431.???","See Below"]
["AA50","FB0247431.???","See Below"]
["AA51","FB0247431.???","See Below"]
["AA52","FB0247431.???","See Below"]
["AA53","FB0247431.???","See Below"]
["AA54","FB0247431.???","See Below"]
["AA55","FB0247431.???","See Below"]
["AB24","FB0247431.???","See Below"]
["AB34","FB0247431.01","ASSY AUX (ZC0228016) H/R-1M 1B S/R-2M 2B"]
["AB36","FB0247431.???","See Below"]
["AB42","FB0247431.03","ASSY AUX (ZC0228016) H/R-2M S/R-4M"]
["AB45","FB0247431.???","See Below"]
["AB46","FB0247431.???","See Below"]
["AB47","FB0247431.???","See Below"]
["AB48","FB0247431.???","See Below"]
["AB49","FB0247431.13","AUX (ZC0228016) H/R-2M S/R-2M 2B"]
["AB50","FB0247431.???","See Below"]
["AB51","FB0247431.???","See Below"]
["AB52","FB0247431.???","See Below"]
["AB53","FB0247431.???","See Below"]
["AB54","FB0247431.???","See Below"]
["AB55","FB0247431.???","See Below"]
["AC24","FB0247431.18","ASSY AUX (ZC0228013) H/R 2B S/R 4M"]
["AC34","FB0247431.???","See Below"]
["AC36","FB0247431.???","See Below"]
["AC42","FB0247431.???","See Below"]
["AC45","FB0247431.04","ASSY AUX (ZC0228013) H/R-1M 1B S/R-3M 1B"]
["AC46","FB0247431.???","See Below"]
["AC47","FB0247431.???","See Below"]
["AC48","FB0247431.???","See Below"]
["AC49","FB0247431.10","ASSY AUX (ZC0228013) H/R-2M S/R-2M 2B"]
["AC50","FB0247431.???","See Below"]
["AC51","FB0247431.???","See Below"]
["AC52","FB0247431.???","See Below"]
["AC53","FB0247431.???","See Below"]
["AC54","FB0247431.???","See Below"]
["AC55","FB0247431.???","See Below"]
["AD24","FB0247431.08","ASSY AUX (ZC0228006) H/R-1M 1B S/R-2M 2B"]
["AD34","FB0247431.06","ASSY AUX (ZC0228006) H/R-1M 1B S/R-2M 2B"]
["AD36","FB0247431.???","See Below"]
["AD42","FB0247431.02","ASSY AUX (ZC0228006) H/R-2M S/R-4M"]
["AD45","FB0247431.05","ASSY AUX (ZC0228006) H/R-1M 1B S/R-3M 1B"]
["AD46","FB0247431.???","See Below"]
["AD47","FB0247431.???","See Below"]
["AD48","FB0247431.11","ASSY AUX (ZC0228006) S/R-3M 1B H/R-2M"]
["AD49","FB0247431.14","ASSY AUX (ZC0228006) H/R-2M S/R-2M 2B"]
["AD50","FB0247431.???","See Below"]
["AD51","FB0247431.07","ASSY AUX (ZC0228006) H/R-2M S/R-4B"]
["AD52","FB0247431.???","See Below"]
["AD53","FB0247431.43","ASSY AUX (ZC0228016)  HR-2B SR-2M 2B"]
["AD54","FB0247431.???","See Below"]
["AD55","FB0247431.???","See Below"]
["AE24","FB0247431.???","See Below"]
["AE34","FB0247431.???","See Below"]
["AE36","FB0247431.???","See Below"]
["AE42","FB0247431.???","See Below"]
["AE45","FB0247431.???","See Below"]
["AE46","FB0247431.???","See Below"]
["AE47","FB0247431.???","See Below"]
["AE48","FB0247431.???","See Below"]
["AE49","FB0247431.???","See Below"]
["AE50","FB0247431.???","See Below"]
["AE51","FB0247431.???","See Below"]
["AE52","FB0247431.???","See Below"]
["AE53","FB0247431.???","See Below"]
["AE54","FB0247431.???","See Below"]
["AE55","FB0247431.???","See Below"]
["AK24","FB0247431.???","See Below"]
["AK34","FB0247431.???","See Below"]
["AK36","FB0247431.???","See Below"]
["AK37","FB0247431.???","See Below"]
["AK42","FB0247431.???","See Below"]
["AK45","FB0247431.???","See Below"]
["AK46","FB0247431.???","See Below"]
["AK47","FB0247431.???","See Below"]
["AK48","FB0247431.???","See Below"]
["AK49","FB0247431.???","See Below"]
["AK50","FB0247431.???","See Below"]
["AK51","FB0247431.???","See Below"]
["AK52","FB0247431.???","See Below"]
["AK53","FB0247431.???","See Below"]
["AK54","FB0247431.???","See Below"]
["AK55","FB0247431.???","See Below"]
["AK56","FB0247431.???","See Below"]
["AK57","FB0247431.???","See Below"]
["AK58","FB0247431.???","See Below"]
["AK59","FB0247431.???","See Below"]
["AK60","FB0247431.???","See Below"]
["AK61","FB0247431.???","See Below"]
["AK62","FB0247431.???","See Below"]
["AK63","FB0247431.???","See Below"]
["AK64","FB0247431.???","See Below"]
["AK65","FB0247431.???","See Below"]
["AK67","FB0247431.???","See Below"]
["AK68","FB0247431.???","See Below"]
["AK69","FB0247431.???","See Below"]
["AK70","FB0247431.???","See Below"]
["AL24","FB0247431.???","See Below"]
["AL34","FB0247431.15","ASSY AUX (ZC0228005) H/R-1M 1B S/R-2M 2B"]
["AL36","FB0247431.???","See Below"]
["AL37","FB0247431.???","See Below"]
["AL42","FB0247431.???","See Below"]
["AL45","FB0247431.???","See Below"]
["AL46","FB0247431.???","See Below"]
["AL47","FB0247431.???","See Below"]
["AL48","FB0247431.???","See Below"]
["AL49","FB0247431.???","See Below"]
["AL50","FB0247431.???","See Below"]
["AL51","FB0247431.???","See Below"]
["AL52","FB0247431.???","See Below"]
["AL53","FB0247431.???","See Below"]
["AL54","FB0247431.???","See Below"]
["AL55","FB0247431.???","See Below"]
["AL56","FB0247431.???","See Below"]
["AL57","FB0247431.???","See Below"]
["AL58","FB0247431.???","See Below"]
["AL59","FB0247431.???","See Below"]
["AL60","FB0247431.???","See Below"]
["AL61","FB0247431.???","See Below"]
["AL62","FB0247431.???","See Below"]
["AL63","FB0247431.???","See Below"]
["AL64","FB0247431.???","See Below"]
["AL65","FB0247431.???","See Below"]
["AL67","FB0247431.???","See Below"]
["AL68","FB0247431.???","See Below"]
["AL69","FB0247431.???","See Below"]
["AL70","FB0247431.???","See Below"]
["BA37","FB0247431.44","ASSY AUX (ZC0228018) HR-4M SR-2M"]
["BA56","FB0247431.???","See Below"]
["BA57","FB0247431.???","See Below"]
["BA58","FB0247431.28","ASSY AUX (ZC0228018) H/R-2M 2B S/R-1M 1B"]
["BA59","FB0247431.???","See Below"]
["BA60","FB0247431.???","See Below"]
["BA61","FB0247431.???","See Below"]
["BA62","FB0247431.???","See Below"]
["BA63","FB0247431.???","See Below"]
["BA64","FB0247431.???","See Below"]
["BA65","FB0247431.???","See Below"]
["BA67","FB0247431.57","ASSY AUX (ZC0228018) HR-3M 1B SR-2M"]
["BA68","FB0247431.???","See Below"]
["BA69","FB0247431.???","See Below"]
["BA70","FB0247431.???","See Below"]
["BB36","FB0247431.52","ASSY AUX (ZC0228016) HR-1M 1B SR-4M"]
["BB37","FB0247431.???","ASSY AUX (ZC0228016) H/R-4M S/R-2M"]
["BB56","FB0247431.???","See Below"]
["BB57","FB0247431.???","See Below"]
["BB58","FB0247431.29","ASSY AUX (ZC0228016) H/R-2M 2B S/R-1M 1B"]
["BB59","FB0247431.???","See Below"]
["BB60","FB0247431.???","See Below"]
["BB61","FB0247431.???","See Below"]
["BB62","FB0247431.???","See Below"]
["BB63","FB0247431.???","See Below"]
["BB64","FB0247431.???","See Below"]
["BB65","FB0247431.???","See Below"]
["BB67","FB0247431.27","ASSY AUX ZC0228016  H/R-3M 1B S/R-2M"]
["BB68","FB0247431.???","See Below"]
["BB69","FB0247431.???","See Below"]
["BB70","FB0247431.???","See Below"]
["BC34","FB0247431.42","ASSY AUX (ZC0228013) HR-1M 1B SR-2M 2B"]
["BC37","FB0247431.???","See Below"]
["BC45","FB0247431.53","ASSY AUX (ZC0228013) HR-1M 1B SR-3M 1B"]
["BC48","FB0247431.51","AUX (coil ZC0228013) SR-3M 1B HR-2M"]
["BC49","FB0247431.10","AUX (coil ZC0228013) HR-2M SR-2M 2B"]
["BC56","FB0247431.???","See Below"]
["BC57","FB0247431.47","ASSY AUX (ZC0228013) HR-3M 1B SR-1M 1B"]
["BC58","FB0247431.30","ASSY AUX (ZC0228013) H/R-2M 2B S/R-1M 1B"]
["BC59","FB0247431.50","ASSY AUX (ZC0228013) HR-1M 3B SR-2M"]
["BC60","FB0247431.???","See Below"]
["BC61","FB0247431.???","See Below"]
["BC62","FB0247431.???","See Below"]
["BC63","FB0247431.25","ASSY AUX (ZC0228013) H/R-2M 2B S/R-2B"]
["BC64","FB0247431???","See Below"]
["BC65","FB0247431???","See Below"]
["BC67","FB0247431???","See Below"]
["BC68","FB0247431.24","ASSY AUX (ZC0228013)  H/R-2M 2B S/R-2M"]
["BC69","FB0247431.???","See Below"]
["BC70","FB0247431.???","See Below"]
["BD34","FB0247431.06","ASSY AUX (ZC0228006) H/R-1M1B, S/R-2M2B"]
["BD37","FB0247431.23","ASSY AUX (ZC0228006) H/R-4M S/R-2M"]
["BD42","FB0247431.02","ASSY AUX (ZC0228006) H/R-2M S/R-4M"]
["BD48","FB0247431.11","AUX (coil ZC0228006) SR-3M 1B HR-2M"]
["BD56","FB0247431.34","ASSY AUX (ZC0228001) HR-4M SR-1M 1B"]
["BD57","FB0247431.31","ASSY AUX (ZC0228006) H/R-3M 1B S/R-1M 1B"]
["BD58","FB0247431.21","ASSY AUX (ZC0228006) H/R-2M 2B S/R-1M 1B"]
["BD59","FB0247431.???","See Below"]
["BD60","FB0247431.???","See Below"]
["BD61","FB0247431.???","See Below"]
["BD62","FB0247431.???","See Below"]
["BD63","FB0247431.???","See Below"]
["BD64","FB0247431.???","See Below"]
["BD65","FB0247431.???","See Below"]
["BD67","FB0247431.???","See Below"]
["BD68","FB0247431.22","ASSY AUX (ZC0228006) H/R-2M 2B S/R-2M"]
["BD69","FB0247431.???","See Below"]
["BD70","FB0247431.???","See Below"]
["BE37","FB0247431.46","ASSY AUX (ZC0228001) H/R-4M S/R-2M"]
["BE56","FB0247431.34","ASSY AUX (ZC0228001) HR-4M SR-1M 1B"]
["BE57","FB0247431.???","See Below"]
["BE58","FB0247431.26","ASSY AUX (ZC0228001) H/R-2M 2B S/R-1M 1B"]
["BE59","FB0247431.???","See Below"]
["BE60","FB0247431.???","See Below"]
["BE61","FB0247431.???","See Below"]
["BE62","FB0247431.???","See Below"]
["BE63","FB0247431.???","See Below"]
["BE64","FB0247431.???","See Below"]
["BE65","FB0247431.???","See Below"]
["BE67","FB0247431.???","See Below"]
["BE68","FB0247431.???","See Below"]
["BE69","FB0247431.???","See Below"]
["BE70","FB0247431.???","See Below"]
["BK24","FB0247431.???","See Below"]
["BK34","FB0247431.???","See Below"]
["BK36","FB0247431.???","See Below"]
["BK37","FB0247431.???","See Below"]
["BK42","FB0247431.???","See Below"]
["BK45","FB0247431.???","See Below"]
["BK46","FB0247431.???","See Below"]
["BK47","FB0247431.???","See Below"]
["BK48","FB0247431.???","See Below"]
["BK49","FB0247431.???","See Below"]
["BK50","FB0247431.???","See Below"]
["BK51","FB0247431.???","See Below"]
["BK52","FB0247431.???","See Below"]
["BK53","FB0247431.???","See Below"]
["BK54","FB0247431.???","See Below"]
["BK55","FB0247431.???","See Below"]
["BK56","FB0247431.???","See Below"]
["BK57","FB0247431.???","See Below"]
["BK58","FB0247431.???","See Below"]
["BK59","FB0247431.???","See Below"]
["BK60","FB0247431.???","See Below"]
["BK61","FB0247431.???","See Below"]
["BK62","FB0247431.???","See Below"]
["BK63","FB0247431.???","See Below"]
["BK64","FB0247431.???","See Below"]
["BK65","FB0247431.???","See Below"]
["BK67","FB0247431.???","See Below"]
["BK68","FB0247431.???","See Below"]
["BK69","FB0247431.???","See Below"]
["BK70","FB0247431.???","See Below"]
["BL24","FB0247431.???","See Below"]
["BL34","FB0247431.???","See Below"]
["BL36","FB0247431.???","See Below"]
["BL37","FB0247431.???","See Below"]
["BL42","FB0247431.???","See Below"]
["BL45","FB0247431.???","See Below"]
["BL46","FB0247431.???","See Below"]
["BL47","FB0247431.???","See Below"]
["BL48","FB0247431.???","See Below"]
["BL49","FB0247431.???","See Below"]
["BL50","FB0247431.???","See Below"]
["BL51","FB0247431.???","See Below"]
["BL52","FB0247431.???","See Below"]
["BL53","FB0247431.???","See Below"]
["BL54","FB0247431.???","See Below"]
["BL55","FB0247431.???","See Below"]
["BL56","FB0247431.???","See Below"]
["BL57","FB0247431.???","See Below"]
["BL58","FB0247431.???","See Below"]
["BL59","FB0247431.???","See Below"]
["BL60","FB0247431.???","See Below"]
["BL61","FB0247431.???","See Below"]
["BL62","FB0247431.???","See Below"]
["BL63","FB0247431.???","See Below"]
["BL64","FB0247431.???","See Below"]
["BL65","FB0247431.???","See Below"]
["BL67","FB0247431.???","See Below"]
["BL68","FB0247431.???","See Below"]
["BL69","FB0247431.???","See Below"]
["BL70","FB0247431.???","See Below"]
["CF24","FB0247444.???","See Below"]
["CF34","FB0247444.???","See Below"]
["CF36","FB0247444.???","See Below"]
["CF42","FB0247444.???","See Below"]
["CF45","FB0247444.???","See Below"]
["CF46","FB0247444.???","See Below"]
["CF47","FB0247444.???","See Below"]
["CF48","FB0247444.???","See Below"]
["CF49","FB0247444.???","See Below"]
["CF50","FB0247444.???","See Below"]
["CF51","FB0247444.???","See Below"]
["CF52","FB0247444.???","See Below"]
["CF53","FB0247444.???","See Below"]
["CF54","FB0247444.???","See Below"]
["CF55","FB0247444.???","See Below"]
["CG24","FB0247444.???","See Below"]
["CG34","FB0247444.???","See Below"]
["CG36","FB0247444.???","See Below"]
["CG42","FB0247444.???","See Below"]
["CG45","FB0247444.???","See Below"]
["CG46","FB0247444.???","See Below"]
["CG47","FB0247444.???","See Below"]
["CG48","FB0247444.???","See Below"]
["CG49","FB0247444.???","See Below"]
["CG50","FB0247444.???","See Below"]
["CG51","FB0247444.???","See Below"]
["CG52","FB0247444.???","See Below"]
["CG53","FB0247444.???","See Below"]
["CG54","FB0247444.???","See Below"]
["CG55","FB0247444.???","See Below"]
["CH24","FB0247444.???","See Below"]
["CH34","FB0247444.???","See Below"]
["CH36","FB0247444.???","See Below"]
["CH42","FB0247444.???","See Below"]
["CH45","FB0247444.???","See Below"]
["CH46","FB0247444.???","See Below"]
["CH47","FB0247444.???","See Below"]
["CH48","FB0247444.???","See Below"]
["CH49","FB0247444.???","See Below"]
["CH50","FB0247444.???","See Below"]
["CH51","FB0247444.???","See Below"]
["CH52","FB0247444.???","See Below"]
["CH53","FB0247444.???","See Below"]
["CH54","FB0247444.???","See Below"]
["CH55","FB0247444.???","See Below"]
["CI24","FB0247444.???","See Below"]
["CI34","FB0247444.???","See Below"]
["CI36","FB0247444.???","See Below"]
["CI42","FB0247444.???","See Below"]
["CI45","FB0247444.???","See Below"]
["CI46","FB0247444.???","See Below"]
["CI47","FB0247444.???","See Below"]
["CI48","FB0247444.???","See Below"]
["CI49","FB0247444.???","See Below"]
["CI50","FB0247444.???","See Below"]
["CI51","FB0247444.???","See Below"]
["CI52","FB0247444.???","See Below"]
["CI53","FB0247444.???","See Below"]
["CI54","FB0247444.???","See Below"]
["CI55","FB0247444.???","See Below"]
["CJ24","FB0247444.???","See Below"]
["CJ34","FB0247444.???","See Below"]
["CJ36","FB0247444.???","See Below"]
["CJ42","FB0247444.???","See Below"]
["CJ45","FB0247444.???","See Below"]
["CJ46","FB0247444.???","See Below"]
["CJ47","FB0247444.???","See Below"]
["CJ48","FB0247444.???","See Below"]
["CJ49","FB0247444.???","See Below"]
["CJ50","FB0247444.???","See Below"]
["CJ51","FB0247444.???","See Below"]
["CJ52","FB0247444.???","See Below"]
["CJ53","FB0247444.???","See Below"]
["CJ54","FB0247444.???","See Below"]
["CJ55","FB0247444.???","See Below"]
["DF37","FB0247443.???","See Below"]
["DF56","FB0247443.???","See Below"]
["DF57","FB0247443.???","See Below"]
["DF58","FB0247443.???","See Below"]
["DF59","FB0247443.???","See Below"]
["DF60","FB0247443.???","See Below"]
["DF61","FB0247443.???","See Below"]
["DF62","FB0247443.???","See Below"]
["DF63","FB0247443.???","See Below"]
["DF64","FB0247443.???","See Below"]
["DF65","FB0247443.???","See Below"]
["DF67","FB0247443.???","See Below"]
["DF68","FB0247443.???","See Below"]
["DF69","FB0247443.???","See Below"]
["DF70","FB0247443.???","See Below"]
["DG37","FB0247443.???","See Below"]
["DG56","FB0247443.???","See Below"]
["DG57","FB0247443.???","See Below"]
["DG58","FB0247443.???","See Below"]
["DG59","FB0247443.???","See Below"]
["DG60","FB0247443.???","See Below"]
["DG61","FB0247443.???","See Below"]
["DG62","FB0247443.???","See Below"]
["DG63","FB0247443.???","See Below"]
["DG64","FB0247443.???","See Below"]
["DG65","FB0247443.???","See Below"]
["DG67","FB0247443.07","ASSY AUX (ZC0229013) H/R-3M 1B S/R-2M"]
["DG68","FB0247443.04","ASSY AUX (ZC0229013) H/R-2M 2B S/R-2M"]
["DG69","FB0247443.???","See Below"]
["DG70","FB0247443.???","See Below"]
["DH37","FB0247443.???","See Below"]
["DH56","FB0247443.???","See Below"]
["DH57","FB0247443.???","See Below"]
["DH58","FB0247443.???","See Below"]
["DH59","FB0247443.???","See Below"]
["DH60","FB0247443.???","See Below"]
["DH61","FB0247443.???","See Below"]
["DH62","FB0247443.???","See Below"]
["DH63","FB0247443.???","See Below"]
["DH64","FB0247443.???","See Below"]
["DH65","FB0247443.???","See Below"]
["DH67","FB0247443.???","See Below"]
["DH68","FB0247443.03","ASSY AUX (ZC0229010) H/R-2M 2B S/R-2M"]
["DH69","FB0247443.???","See Below"]
["DH70","FB0247443.???","See Below"]
["DI37","FB0247443.???","See Below"]
["DI56","FB0247443.???","See Below"]
["DI57","FB0247443.???","See Below"]
["DI58","FB0247443.???","See Below"]
["DI59","FB0247443.???","See Below"]
["DI60","FB0247443.???","See Below"]
["DI61","FB0247443.???","See Below"]
["DI62","FB0247443.???","See Below"]
["DI63","FB0247443.???","See Below"]
["DI64","FB0247443.???","See Below"]
["DI65","FB0247443.???","See Below"]
["DI67","FB0247443.01","ASSY AUX (ZC0229003) H/R-3M 1B S/R-2M"]
["DI68","FB0247443.02","ASSY AUX (ZC0229003) H/R-2M 2B S/R-2M"]
["DI69","FB0247443.???","See Below"]
["DI70","FB0247443.???","See Below"]
["DJ37","FB0247443.???","See Below"]
["DJ56","FB0247443.???","See Below"]
["DJ57","FB0247443.???","See Below"]
["DJ58","FB0247443.???","See Below"]
["DJ59","FB0247443.???","See Below"]
["DJ60","FB0247443.???","See Below"]
["DJ61","FB0247443.???","See Below"]
["DJ62","FB0247443.???","See Below"]
["DJ63","FB0247443.???","See Below"]
["DJ64","FB0247443.???","See Below"]
["DJ65","FB0247443.???","See Below"]
["DJ67","FB0247443.???","See Below"]
["DJ68","FB0247443.???","See Below"]
["DJ69","FB0247443.???","See Below"]
["DJ70","FB0247443.???","See Below"]

{"sheet":"Database","index":6,"n_rows":410,"n_cols":22,"rows_kept":410,"cut":false,"hidden":true,"merged":[]}
[null,1,{"$f":"VLOOKUP(B1,A2:C10,3,FALSE)","v":"A"},"A","24 - 27 Vac/Vdc","30 - 34 Vac/Vdc","48 - 54 Vac/Vdc","110 - 125 Vac/Vdc","220 - 250 Vac/Vdc","0000","0250","0500","0750","1000","Not Required for This Relay"," "," "," ","C","C","C"]
[1,{"$f":"HLOOKUP('Date Drivers'!$B$1,'Date Drivers'!$B$2:$D$83,2)","v":"Standard Time"},{"$f":"HLOOKUP('Date Drivers'!$B$1,'Date Drivers'!$D$2:$D$83,10)","v":"A"},"C","110 - 125 Vac/Vdc"," "," "," "," ","0750","0750","0750","0750","0750","Not Required for This Relay"," "," "," ","C","C","C"]
[2,{"$f":"HLOOKUP('Date Drivers'!$B$1,'Date Drivers'!$B$2:$D$83,3)","v":"High Speed to operate in < 10 millisecs (TEMPORARILLY WITHDRAWN)"},{"$f":"HLOOKUP('Date Drivers'!$B$1,'Date Drivers'!$D$2:$D$83,11)","v":"*"},"G","24 - 27 Vac/Vdc","30 - 34 Vac/Vdc","48 - 54 Vac/Vdc","110 - 125 Vac/Vdc","220 - 250 Vac/Vdc","0000","0250","0500","0750","1000","Not Required for This Relay"," "," "," ","C","C","C"]
[3,{"$f":"HLOOKUP('Date Drivers'!$B$1,'Date Drivers'!$B$2:$D$83,4)","v":"Delayed on drop off by single slug rear mounted"},{"$f":"HLOOKUP('Date Drivers'!$B$1,'Date Drivers'!$D$2:$D$83,12)","v":"G"},"K","110 - 125 Vac/Vdc"," "," "," "," ","0750","0750","0750","0750","0750","Delayed Pick Up Range"]
[4,{"$f":"HLOOKUP('Date Drivers'!$B$1,'Date Drivers'!$B$2:$D$83,5)","v":"Delayed on pick up by C-R circuit - Range 46 - 50 milliseconds"},{"$f":"HLOOKUP('Date Drivers'!$B$1,'Date Drivers'!$D$2:$D$83,13)","v":"K"},"L","30 - 34 Vac/Vdc"," "," "," "," ","0250","0250","0250","0250","0250","Delayed Drop Off Range",null,null,{"$f":"VLOOKUP($B$11,$O$16:$U$17,4)","v":" "},{"$f":"VLOOKUP($B$11,$O$16:$U$17,5)","v":"H"},{"$f":"VLOOKUP($B$11,$O$16:$U$17,6)","v":"H"},{"$f":"VLOOKUP($B$11,$O$16:$U$17,7)","v":"H"}]
[5,{"$f":"HLOOKUP('Date Drivers'!$B$1,'Date Drivers'!$B$2:$D$83,6)","v":"Delayed on pick up by C-R circuit - Range 70 - 100 milliseconds"},{"$f":"HLOOKUP('Date Drivers'!$B$1,'Date Drivers'!$D$2:$D$83,14)","v":"L"},"M","110 - 125 Vac/Vdc"," "," "," "," ","0750","0750","0750","0750","0750","Delayed Pick Up Range"]
[6,{"$f":"HLOOKUP('Date Drivers'!$B$1,'Date Drivers'!$B$2:$D$83,7)","v":"Delayed on pick up by C-R circuit - Range 100 - 120 milliseconds"},{"$f":"HLOOKUP('Date Drivers'!$B$1,'Date Drivers'!$D$2:$D$83,15)","v":"M"},"N","110 - 125 Vac/Vdc"," "," "," "," ","0750","0750","0750","0750","0750","Delayed Pick Up Range"]
[7,{"$f":"HLOOKUP('Date Drivers'!$B$1,'Date Drivers'!$B$2:$D$83,8)","v":"Delayed on drop off by C-R circuit - Range 100 - 200 milliseconds"},{"$f":"HLOOKUP('Date Drivers'!$B$1,'Date Drivers'!$D$2:$D$83,16)","v":"N"},"P","30 - 34 Vac/Vdc"," "," "," "," ","0250","0250","0250","0250","0250","Delayed Drop Off Range"]
[8,{"$f":"HLOOKUP('Date Drivers'!$B$1,'Date Drivers'!$B$2:$D$83,9)","v":"Delayed on drop off by C-R circuit - Range 150 - 250 milliseconds"},{"$f":"HLOOKUP('Date Drivers'!$B$1,'Date Drivers'!$D$2:$D$83,17)","v":"P"},1,2]
[null,null,null,"4 Make","2 Make",null,null,null,null,null,null,null,null,null,null,null,null,null," "," "," "," "]
[null,1,{"$f":"VLOOKUP(B11,A12:C16,3,FALSE)","v":"0000"},"3 Make & 1 Break","1 Make & 1 Break",null,null,null,null,null,null,null,null,null,null,null,null,null," "," "," "," "]
[1,{"$f":"HLOOKUP('Date Drivers'!$B$1,'Date Drivers'!$B$2:$D$83,18)","v":"24 - 27 Vac/Vdc"},{"$f":"HLOOKUP('Date Drivers'!$B$1,'Date Drivers'!$B$2:$D$83,23)","v":"0000"},"2 Make & 2 Break","2 Break",null,null,null,null,null,null,null,null,null,null,null,null,null," "," "," "," "]
[2,{"$f":"HLOOKUP('Date Drivers'!$B$1,'Date Drivers'!$B$2:$D$83,19)","v":"30 - 34 Vac/Vdc"},{"$f":"HLOOKUP('Date Drivers'!$B$1,'Date Drivers'!$B$2:$D$83,24)","v":"0250"},"1 Make & 3 Break","1 Make & 1 Cut Out Contact"," "," "," "," "," "," "," "," "," "," ",null,null," ","E","E","E"]
[3,{"$f":"HLOOKUP('Date Drivers'!$B$1,'Date Drivers'!$B$2:$D$83,20)","v":"48 - 54 Vac/Vdc"},{"$f":"HLOOKUP('Date Drivers'!$B$1,'Date Drivers'!$B$2:$D$83,25)","v":"0500"},"4 Break","1 Break & 1 Cut Out Contact",{"$f":"C1","v":"A"}," "," "," "," "," "," "," "," "," ",null,null," ","D","F","F"]
[4,{"$f":"HLOOKUP('Date Drivers'!$B$1,'Date Drivers'!$B$2:$D$83,21)","v":"110 - 125 Vac/Vdc"},{"$f":"HLOOKUP('Date Drivers'!$B$1,'Date Drivers'!$B$2:$D$83,26)","v":"0750"},"3 Make & 1 Cut Out Contact"," ","A","HAND AND SELF RESET CONTACTS WITH HAND RESET INDICATOR (SINGLE STACK ONLY)",null,null,null,null,null,null," ","K"]
[5,{"$f":"HLOOKUP('Date Drivers'!$B$1,'Date Drivers'!$B$2:$D$83,22)","v":"220 - 250 Vac/Vdc"},{"$f":"HLOOKUP('Date Drivers'!$B$1,'Date Drivers'!$B$2:$D$83,27)","v":"1000"},"2 Make, 1 Break & 1 Cut Out Contact"," ","C","HAND AND SELF RESET CONTACTS WITH HAND RESET FLAG INDICATOR. HIGH SPEED RELAY TO OPERATE IN LESS THAN 10 M/SECONDS. (SINGLE STACK ONLY)"," ",null," "," "," ",null,"30-34",1,"70 - 100 M/Sec"," "," ","H","H","H"]
[null,null,null,"1 Make, 2 Break & 1 Cut Out Contact"," ","G","HAND AND SELF RESET CONTACTS WITH HAND RESET INDICATOR , WITH OR WITHOUT CUT OFF CONTACT. (SINGLE STACK ONLY)"," ",null,null,null,null,null,"110-125",2,"46 - 50 M/Sec","100 - 120 M/Sec"," ","G","G","G"]
[null,1,null,"3 Break & 1 Cut Out Contact"," ","K","HAND AND SELF RESET CONTACTS WITH HAND RESET FLAG INDICATOR, WITH OR WITHOUT CUT OFF CONTACT (SINGLE STACK ONLY) DELAYED ON PICK UP BY C-R CIRCUIT"," ",null,null,null,null,null,null,"L"]
[1,{"$f":"HLOOKUP('Date Drivers'!$B$1,'Date Drivers'!$B$2:$D$83,28)","v":"4 Hand Reset & 2 Self Reset"},{"$f":"HLOOKUP('Date Drivers'!$B$1,'Date Drivers'!$B$2:$D$83,30)","v":1},"0016","0001","L","HAND AND SELF RESET CONTACTS WITH HAND RESET FLAG INDICATOR, WITH OR WITHOUT CUT OFF CONTACT (SINGLE STACK ONLY) DELAYED ON PICK UP BY C-R CIRCUIT"," ",null,null,null,null,null,"30-34",1,"150 - 250 M/Sec"," "]
[2,{"$f":"HLOOKUP('Date Drivers'!$B$1,'Date Drivers'!$B$2:$D$83,29)","v":"2 Hand Reset & 4 Self Reset"},{"$f":"HLOOKUP('Date Drivers'!$B$1,'Date Drivers'!$B$2:$D$83,31)","v":2},"0017","0006","M","HAND AND SELF RESET CONTACTS WITH HAND RESET FLAG INDICATOR, WITH OR WITHOUT CUT OFF CONTACT (SINGLE STACK ONLY) DELAYED ON PICK UP BY C-R CIRCUIT",null,null,null,null,null,null,"110-125",2,"100 - 200 M/Sec"," "]
[null,null,null,"0018","0011","N","HAND AND SELF RESET CONTACTS WITH HAND RESET FLAG INDICATOR, WITH OR WITHOUT CUT OFF CONTACT (SINGLE STACK ONLY) DELAYED ON DROP OFF BY C-R CIRCUIT"]
[null,1,null,"0019","0101","P","HAND AND SELF RESET CONTACTS WITH HAND RESET FLAG INDICATOR, WITH OR WITHOUT CUT OFF CONTACT (SINGLE STACK ONLY) DELAYED ON DROP OFF BY C-R CIRCUIT"]
[1,{"$f":"HLOOKUP('Date Drivers'!$B$1,'Date Drivers'!$B$2:$D$83,32)","v":"4 Make"},{"$f":"HLOOKUP('Date Drivers'!$B$1,'Date Drivers'!$B$2:$D$83,41)","v":"0016"},"0020","0106"]
[2,{"$f":"HLOOKUP('Date Drivers'!$B$1,'Date Drivers'!$B$2:$D$83,33)","v":"3 Make & 1 Break"},{"$f":"HLOOKUP('Date Drivers'!$B$1,'Date Drivers'!$B$2:$D$83,42)","v":"0017"},"0111","0106"]
[3,{"$f":"HLOOKUP('Date Drivers'!$B$1,'Date Drivers'!$B$2:$D$83,34)","v":"2 Make & 2 Break"},{"$f":"HLOOKUP('Date Drivers'!$B$1,'Date Drivers'!$B$2:$D$83,43)","v":"0018"},"0112","0106"]
[4,{"$f":"HLOOKUP('Date Drivers'!$B$1,'Date Drivers'!$B$2:$D$83,35)","v":"1 Make & 3 Break"},{"$f":"HLOOKUP('Date Drivers'!$B$1,'Date Drivers'!$B$2:$D$83,44)","v":"0019"},"0113","0106"]
[5,{"$f":"HLOOKUP('Date Drivers'!$B$1,'Date Drivers'!$B$2:$D$83,36)","v":"4 Break"},{"$f":"HLOOKUP('Date Drivers'!$B$1,'Date Drivers'!$B$2:$D$83,45)","v":"0020"},"0114","0106",{"$f":"B1","v":1}]
[6,{"$f":"HLOOKUP('Date Drivers'!$B$1,'Date Drivers'!$B$2:$D$83,37)","v":"3 Make & 1 Cut Out Contact"},{"$f":"HLOOKUP('Date Drivers'!$B$1,'Date Drivers'!$B$2:$D$83,46)","v":"0111"},"2 Make","4 Make",4,"46-50 Milliseconds"]
[7,{"$f":"HLOOKUP('Date Drivers'!$B$1,'Date Drivers'!$B$2:$D$83,38)","v":"2 Make, 1 Break & 1 Cut Out Contact"},{"$f":"HLOOKUP('Date Drivers'!$B$1,'Date Drivers'!$B$2:$D$83,47)","v":"0112"},"1 Make & 1 Break","3 Make & 1 Break",5,"70-100 Milliseconds"]
[8,{"$f":"HLOOKUP('Date Drivers'!$B$1,'Date Drivers'!$B$2:$D$83,39)","v":"1 Make, 2 Break & 1 Cut Out Contact"},{"$f":"HLOOKUP('Date Drivers'!$B$1,'Date Drivers'!$B$2:$D$83,48)","v":"0113"},"2 Break","2 Make & 2 Break",6,"100-120 Milliseconds"]
[9,{"$f":"HLOOKUP('Date Drivers'!$B$1,'Date Drivers'!$B$2:$D$83,40)","v":"3 Break & 1 Cut Out Contact"},{"$f":"HLOOKUP('Date Drivers'!$B$1,'Date Drivers'!$B$2:$D$83,49)","v":"0114"}," ","1 Make & 3 Break",7,"100-200 Milliseconds"]
[null,null,null," ","4 Break",8,"150-250 Milliseconds"]
[null,1,null,"0000","0000"]
[1,{"$f":"HLOOKUP('Date Drivers'!$B$1,'Date Drivers'!$B$2:$D$83,50)","v":"2 Make"},{"$f":"HLOOKUP('Date Drivers'!$B$1,'Date Drivers'!$B$2:$D$83,55)","v":"0000"},"0005","0001"]
[2,{"$f":"HLOOKUP('Date Drivers'!$B$1,'Date Drivers'!$B$2:$D$83,51)","v":"1 Make & 1 Break"},{"$f":"HLOOKUP('Date Drivers'!$B$1,'Date Drivers'!$B$2:$D$83,56)","v":"0005"},"0010","0002"]
[3,{"$f":"HLOOKUP('Date Drivers'!$B$1,'Date Drivers'!$B$2:$D$83,52)","v":"2 Break"},{"$f":"HLOOKUP('Date Drivers'!$B$1,'Date Drivers'!$B$2:$D$83,57)","v":"0010"},"0010","0003"]
[4,{"$f":"HLOOKUP('Date Drivers'!$B$1,'Date Drivers'!$B$2:$D$83,53)","v":" "},{"$f":"HLOOKUP('Date Drivers'!$B$1,'Date Drivers'!$B$2:$D$83,58)","v":"0010"},"0010","0004"]
[5,{"$f":"HLOOKUP('Date Drivers'!$B$1,'Date Drivers'!$B$2:$D$83,54)","v":" "},{"$f":"HLOOKUP('Date Drivers'!$B$1,'Date Drivers'!$B$2:$D$83,59)","v":"0010"}]
[]
[null,null,{"$f":"Configurator!D15+Configurator!D19+Configurator!D21","v":16}]
[null,1,"0001"]
[null,2,"0002"]
[null,3,"0003"]
[null,4,"0004"]
[null,5,"0005"]
[null,6,"0006"]
[null,7,"0007"]
[null,8,"0008"]
[null,9,"0009"]
[null,10,"0010"]
[null,11,"0011"]
[null,12,"0012"]
[null,13,"0013"]
[null,14,"0014"]
[null,15,"0015"]
[null,16,"0016"]
[null,17,"0017"]
[null,18,"0018"]
[null,19,"0019"]
[null,20,"0020"]
[null,21,"0021"]
[null,22,"0022"]
[null,23,"0023"]
[null,24,"0024"]
[null,25,"0025"]
[null,26,"0026"]
[null,27,"0027"]
[null,28,"0028"]
[null,29,"0029"]
[null,30,"0030"]
[null,101,"0101"]
[null,102,"0102"]
[null,103,"0103"]
[null,104,"0104"]
[null,105,"0105"]
[null,106,"0106"]
[null,107,"0107"]
[null,108,"0108"]
[null,109,"0109"]
[null,110,"0110"]
[null,111,"0111"]
[null,112,"0112"]
[null,113,"0113"]
[null,114,"0114"]
[null,115,"0115"]
[null,116,"0116"]
[null,117,"0117"]
[null,118,"0118"]
[null,119,"0119"]
[null,120,"0120"]
[null,121,"0121"]
[null,122,"0122"]
[null,123,"0123"]
[null,124,"0124"]
[null,251,"0251"]
[null,252,"0252"]
[null,253,"0253"]
[null,254,"0254"]
[null,255,"0255"]
[null,256,"0256"]
[null,257,"0257"]
[null,258,"0258"]
[null,259,"0259"]
[null,260,"0260"]
[null,261,"0261"]
[null,262,"0262"]
[null,263,"0263"]
[null,264,"0264"]
[null,265,"0265"]
[null,266,"0266"]
[null,267,"0267"]
[null,268,"0268"]
[null,269,"0269"]
[null,270,"0270"]
[null,271,"0271"]
[null,272,"0272"]
[null,273,"0273"]
[null,274,"0274"]
[null,275,"0275"]
[null,276,"0276"]
[null,277,"0277"]
[null,278,"0278"]
[null,279,"0279"]
[null,280,"0280"]
[null,351,"0351"]
[null,352,"0352"]
[null,353,"0353"]
[null,354,"0354"]
[null,355,"0355"]
[null,356,"0356"]
[null,357,"0357"]
[null,358,"0358"]
[null,359,"0359"]
[null,360,"0360"]
[null,361,"0361"]
[null,362,"0362"]
[null,363,"0363"]
[null,364,"0364"]
[null,365,"0365"]
[null,366,"0366"]
[null,367,"0367"]
[null,368,"0368"]
[null,369,"0369"]
[null,370,"0370"]
[null,371,"0371"]
[null,372,"0372"]
[null,373,"0373"]
[null,374,"0374"]
[null,501,"0501"]
[null,502,"0502"]
[null,503,"0503"]
[null,504,"0504"]
[null,505,"0505"]
[null,506,"0506"]
[null,507,"0507"]
[null,508,"0508"]
[null,509,"0509"]
[null,510,"0510"]
[null,511,"0511"]
[null,512,"0512"]
[null,513,"0513"]
[null,514,"0514"]
[null,515,"0515"]
[null,516,"0516"]
[null,517,"0517"]
[null,518,"0518"]
[null,519,"0519"]
[null,520,"0520"]
[null,521,"0521"]
[null,522,"0522"]
[null,523,"0523"]
[null,524,"0524"]
[null,525,"0525"]
[null,526,"0526"]
[null,527,"0527"]
[null,528,"0528"]
[null,529,"0529"]
[null,530,"0530"]
[null,601,"0601"]
[null,602,"0602"]
[null,603,"0603"]
[null,604,"0604"]
[null,605,"0605"]
[null,606,"0606"]
[null,607,"0607"]
[null,608,"0608"]
[null,609,"0609"]
[null,610,"0610"]
[null,611,"0611"]
[null,612,"0612"]
[null,613,"0613"]
[null,614,"0614"]
[null,615,"0615"]
[null,616,"0616"]
[null,617,"0617"]
[null,618,"0618"]
[null,619,"0619"]
[null,620,"0620"]
[null,621,"0621"]
[null,622,"0622"]
[null,623,"0623"]
[null,624,"0624"]
[null,751,"0751"]
[null,752,"0752"]
[null,753,"0753"]
[null,754,"0754"]
[null,755,"0755"]
[null,756,"0756"]
[null,757,"0757"]
[null,758,"0758"]
[null,759,"0759"]
[null,760,"0760"]
[null,761,"0761"]
[null,762,"0762"]
[null,763,"0763"]
[null,764,"0764"]
[null,765,"0765"]
[null,766,"0766"]
[null,767,"0767"]
[null,768,"0768"]
[null,769,"0769"]
[null,770,"0770"]
[null,771,"0771"]
[null,772,"0772"]
[null,773,"0773"]
[null,774,"0774"]
[null,775,"0775"]
[null,776,"0776"]
[null,777,"0777"]
[null,778,"0778"]
[null,779,"0779"]
[null,780,"0780"]
[null,851,"0851"]
[null,852,"0852"]
[null,853,"0853"]
[null,854,"0854"]
[null,855,"0855"]
[null,856,"0856"]
[null,857,"0857"]
[null,858,"0858"]
[null,859,"0859"]
[null,860,"0860"]
[null,861,"0861"]
[null,862,"0862"]
[null,863,"0863"]
[null,864,"0864"]
[null,865,"0865"]
[null,866,"0866"]
[null,867,"0867"]
[null,868,"0868"]
[null,869,"0869"]
[null,870,"0870"]
[null,871,"0871"]
[null,872,"0872"]
[null,873,"0873"]
[null,874,"0874"]
[null,1001,"1001"]
[null,1002,"1002"]
[null,1003,"1003"]
[null,1004,"1004"]
[null,1005,"1005"]
[null,1006,"1006"]
[null,1007,"1007"]
[null,1008,"1008"]
[null,1009,"1009"]
[null,1010,"1010"]
[null,1011,"1011"]
[null,1012,"1012"]
[null,1013,"1013"]
[null,1014,"1014"]
[null,1015,"1015"]
[null,1016,"1016"]
[null,1017,"1017"]
[null,1018,"1018"]
[null,1019,"1019"]
[null,1020,"1020"]
[null,1021,"1021"]
[null,1022,"1022"]
[null,1023,"1023"]
[null,1024,"1024"]
[null,1025,"1025"]
[null,1026,"1026"]
[null,1027,"1027"]
[null,1028,"1028"]
[null,1029,"1029"]
[null,1030,"1030"]
[null,1101,"1101"]
[null,1102,"1102"]
[null,1103,"1103"]
[null,1104,"1104"]
[null,1105,"1105"]
[null,1106,"1106"]
[null,1107,"1107"]
[null,1108,"1108"]
[null,1109,"1109"]
[null,1110,"1110"]
[null,1111,"1111"]
[null,1112,"1112"]
[null,1113,"1113"]
[null,1114,"1114"]
[null,1115,"1115"]
[null,1116,"1116"]
[null,1117,"1117"]
[null,1118,"1118"]
[null,1119,"1119"]
[null,1120,"1120"]
[null,1121,"1121"]
[null,1122,"1122"]
[null,1123,"1123"]
[null,1124,"1124"]
[null,1]
[1,{"$f":"HLOOKUP('Date Drivers'!$B$1,'Date Drivers'!$B$2:$D$83,60)","v":"With Hand Reset Flag"},{"$f":"HLOOKUP('Date Drivers'!$B$1,'Date Drivers'!$B$2:$D$83,61)","v":"B"}]
[]
[null,"Auxiliary Units",{"$f":"B1*10+B18","v":11}]
[null,11,"FB0247431","B"]
[null,12,"FB0247431","A"]
[null,21,"FB0247431","B"]
[null,22,"FB0247431","A"]
[null,31,"FB0247443","D"]
[null,32,"FB0247444","C"]
[null,41,"FB0247431","B"]
[null,42,"FB0247431","A"]
[null,51,"FB0247431","B"]
[null,52,"FB0247431","A"]
[null,61,"FB0247431","B"]
[null,62,"FB0247431","A"]
[null,71,"FB0247431","B"]
[null,72,"FB0247431","A"]
[null,81,"FB0247431","B"]
[null,82,"FB0247431","A"]
[]
[null,"Coils",{"$f":"B1*10+B11","v":11}]
[null,11,"ZC0228018","A"]
[null,12,"ZC0228016","B"]
[null,13,"ZC0228013","C"]
[null,14,"ZC0228006","D"]
[null,15,"ZC0228001","E"]
[null,21,"ZC0228005","L"]
[null,31,"ZC0229015","F"]
[null,32,"ZC0229013","G"]
[null,33,"ZC0229010","H"]
[null,34,"ZC0229003","I"]
[null,35,"ZC0229001","J"]
[null,41,"ZC0228013","C"]
[null,51,"ZC0228017","K"]
[null,61,"ZC0228013","C"]
[null,71,"ZC0228006","D"]
[null,81,"ZC0228016","B"]
[]
[null,"Contacts",{"$f":"B18*100+B22*10+B33","v":111}]
[null,111,"FB0315037",37]
[null,112,"FB0315056",56]
[null,113,"FB0315061",61]
[null,121,"FB0315067",67]
[null,122,"FB0315057",57]
[null,123,"FB0315062",62]
[null,131,"FB0315068",68]
[null,132,"FB0315058",58]
[null,133,"FB0315063",63]
[null,141,"FB0315069",69]
[null,142,"FB0315059",59]
[null,143,"FB0315064",64]
[null,151,"FB0315070",70]
[null,152,"FB0315060",60]
[null,153,"FB0315065",65]
[null,161,"FB0315067",67]
[null,162,"FB0315057",57]
[null,163,"FB0315062",62]
[null,171,"FB0315068",68]
[null,172,"FB0315058",58]
[null,173,"FB0315063",63]
[null,181,"FB0315069",69]
[null,182,"FB0315059",59]
[null,183,"FB0315064",64]
[null,191,"FB0315070",70]
[null,192,"FB0315060",60]
[null,193,"FB0315065",65]
[null,211,"FB0315042",42]
[null,212,"FB0315048",48]
[null,213,"FB0315049",49]
[null,214,"FB0315050",50]
[null,215,"FB0315051",51]
[null,221,"FB0315036",36]
[null,222,"FB0315045",45]
[null,223,"FB0315034",34]
[null,224,"FB0315046",46]
[null,225,"FB0315047",47]
[null,231,"FB0315024",24]
[null,232,"FB0315052",52]
[null,233,"FB0315053",53]
[null,234,"FB0315054",54]
[null,235,"FB0315055",55]
[null,241,"FB0315036",36]
[null,242,"FB0315045",45]
[null,243,"FB0315034",34]
[null,244,"FB0315046",46]
[null,245,"FB0315047",47]
[null,251,"FB0315024",24]
[null,252,"FB0315052",52]
[null,253,"FB0315053",53]
[null,254,"FB0315054",54]
[null,255,"FB0315055",55]
[]
["Drawings",null,{"$f":"Configurator!D6","v":"R"}]
["J","GJ0025.SHEET.1"]
["L","GJ0025.SHEET.3"]
["R","GJ0025.SHEET.1"]
[]
["Cases"]
[{"$f":"HLOOKUP('Date Drivers'!$B$1,'Date Drivers'!$B$2:$D$70,69)","v":"R"}]

{"sheet":"Date Drivers","index":7,"n_rows":70,"n_cols":4,"rows_kept":70,"cut":false,"hidden":true,"merged":[]}
["Key Date",{"$f":"IF(Configurator!$A$4=\"\",TODAY(),Configurator!$A$4)","v":"2018-10-23"}]
[null,"2003-06-11","2004-11-01","2007-09-25"]
["Time Function","Standard Time","Standard Time","Standard Time"]
[null,"High Speed to operate in less than 10 milliseconds","High Speed to operate in less than 10 milliseconds","High Speed to operate in < 10 millisecs (TEMPORARILLY WITHDRAWN)"]
[null,"Delayed on drop off by single slug rear mounted","Delayed on drop off by single slug rear mounted","Delayed on drop off by single slug rear mounted"]
[null,"Delayed on pick up by C-R circuit - Range 46 - 50 milliseconds","Delayed on pick up by C-R circuit - Range 46 - 50 milliseconds","Delayed on pick up by C-R circuit - Range 46 - 50 milliseconds"]
[null,"Delayed on pick up by C-R circuit - Range 70 - 100 milliseconds","Delayed on pick up by C-R circuit - Range 70 - 100 milliseconds","Delayed on pick up by C-R circuit - Range 70 - 100 milliseconds"]
[null,"Delayed on pick up by C-R circuit - Range 100 - 120 milliseconds","Delayed on pick up by C-R circuit - Range 100 - 120 milliseconds","Delayed on pick up by C-R circuit - Range 100 - 120 milliseconds"]
[null,"Delayed on drop off by C-R circuit - Range 100 - 200 milliseconds","Delayed on drop off by C-R circuit - Range 100 - 200 milliseconds","Delayed on drop off by C-R circuit - Range 100 - 200 milliseconds"]
[null,"Delayed on drop off by C-R circuit - Range 150 - 250 milliseconds","Delayed on drop off by C-R circuit - Range 150 - 250 milliseconds","Delayed on drop off by C-R circuit - Range 150 - 250 milliseconds"]
[null,"A","A","A"]
[null,"C","C","*"]
["Required Voltage","G","G","G"]
[null,"K","K","K"]
[null,"L","L","L"]
[null,"M","M","M"]
[null,"N","N","N"]
[null,"P","P","P"]
[null,{"$f":"VLOOKUP(Database!$C$1,Database!$D$1:$N$9,2,FALSE)","v":"24 - 27 Vac/Vdc"},{"$f":"VLOOKUP(Database!$C$1,Database!$D$1:$N$9,2,FALSE)","v":"24 - 27 Vac/Vdc"},{"$f":"VLOOKUP(Database!$C$1,Database!$D$1:$N$9,2,FALSE)","v":"24 - 27 Vac/Vdc"}]
[null,{"$f":"VLOOKUP(Database!$C$1,Database!$D$1:$N$9,3,FALSE)","v":"30 - 34 Vac/Vdc"},{"$f":"VLOOKUP(Database!$C$1,Database!$D$1:$N$9,3,FALSE)","v":"30 - 34 Vac/Vdc"},{"$f":"VLOOKUP(Database!$C$1,Database!$D$1:$N$9,3,FALSE)","v":"30 - 34 Vac/Vdc"}]
[null,{"$f":"VLOOKUP(Database!$C$1,Database!$D$1:$N$9,4,FALSE)","v":"48 - 54 Vac/Vdc"},{"$f":"VLOOKUP(Database!$C$1,Database!$D$1:$N$9,4,FALSE)","v":"48 - 54 Vac/Vdc"},{"$f":"VLOOKUP(Database!$C$1,Database!$D$1:$N$9,4,FALSE)","v":"48 - 54 Vac/Vdc"}]
[null,{"$f":"VLOOKUP(Database!$C$1,Database!$D$1:$N$9,5,FALSE)","v":"110 - 125 Vac/Vdc"},{"$f":"VLOOKUP(Database!$C$1,Database!$D$1:$N$9,5,FALSE)","v":"110 - 125 Vac/Vdc"},{"$f":"VLOOKUP(Database!$C$1,Database!$D$1:$N$9,5,FALSE)","v":"110 - 125 Vac/Vdc"}]
["Contact Arrangement",{"$f":"VLOOKUP(Database!$C$1,Database!$D$1:$N$9,6,FALSE)","v":"220 - 250 Vac/Vdc"},{"$f":"VLOOKUP(Database!$C$1,Database!$D$1:$N$9,6,FALSE)","v":"220 - 250 Vac/Vdc"},{"$f":"VLOOKUP(Database!$C$1,Database!$D$1:$N$9,6,FALSE)","v":"220 - 250 Vac/Vdc"}]
[null,{"$f":"VLOOKUP(Database!$C$1,Database!$D$1:$N$9,7,FALSE)","v":"0000"},{"$f":"VLOOKUP(Database!$C$1,Database!$D$1:$N$9,7,FALSE)","v":"0000"},{"$f":"VLOOKUP(Database!$C$1,Database!$D$1:$N$9,7,FALSE)","v":"0000"}]
[null,{"$f":"VLOOKUP(Database!$C$1,Database!$D$1:$N$9,8,FALSE)","v":"0250"},{"$f":"VLOOKUP(Database!$C$1,Database!$D$1:$N$9,8,FALSE)","v":"0250"},{"$f":"VLOOKUP(Database!$C$1,Database!$D$1:$N$9,8,FALSE)","v":"0250"}]
[null,{"$f":"VLOOKUP(Database!$C$1,Database!$D$1:$N$9,9,FALSE)","v":"0500"},{"$f":"VLOOKUP(Database!$C$1,Database!$D$1:$N$9,9,FALSE)","v":"0500"},{"$f":"VLOOKUP(Database!$C$1,Database!$D$1:$N$9,9,FALSE)","v":"0500"}]
["Hand Reset Contacts",{"$f":"VLOOKUP(Database!$C$1,Database!$D$1:$N$9,10,FALSE)","v":"0750"},{"$f":"VLOOKUP(Database!$C$1,Database!$D$1:$N$9,10,FALSE)","v":"0750"},{"$f":"VLOOKUP(Database!$C$1,Database!$D$1:$N$9,10,FALSE)","v":"0750"}]
[null,{"$f":"VLOOKUP(Database!$C$1,Database!$D$1:$N$9,11,FALSE)","v":"1000"},{"$f":"VLOOKUP(Database!$C$1,Database!$D$1:$N$9,11,FALSE)","v":"1000"},{"$f":"VLOOKUP(Database!$C$1,Database!$D$1:$N$9,11,FALSE)","v":"1000"}]
[null,"4 Hand Reset & 2 Self Reset","4 Hand Reset & 2 Self Reset","4 Hand Reset & 2 Self Reset"]
[null,"2 Hand Reset & 4 Self Reset","2 Hand Reset & 4 Self Reset","2 Hand Reset & 4 Self Reset"]
[null,1,1,1]
[null,2,2,2]
[null,{"$f":"HLOOKUP(Database!$B$18,Database!$D$9:$E$18,2,FALSE)","v":"4 Make"},{"$f":"HLOOKUP(Database!$B$18,Database!$D$9:$E$18,2,FALSE)","v":"4 Make"},{"$f":"HLOOKUP(Database!$B$18,Database!$D$9:$E$18,2,FALSE)","v":"4 Make"}]
[null,{"$f":"HLOOKUP(Database!$B$18,Database!$D$9:$E$18,3,FALSE)","v":"3 Make & 1 Break"},{"$f":"HLOOKUP(Database!$B$18,Database!$D$9:$E$18,3,FALSE)","v":"3 Make & 1 Break"},{"$f":"HLOOKUP(Database!$B$18,Database!$D$9:$E$18,3,FALSE)","v":"3 Make & 1 Break"}]
[null,{"$f":"HLOOKUP(Database!$B$18,Database!$D$9:$E$18,4,FALSE)","v":"2 Make & 2 Break"},{"$f":"HLOOKUP(Database!$B$18,Database!$D$9:$E$18,4,FALSE)","v":"2 Make & 2 Break"},{"$f":"HLOOKUP(Database!$B$18,Database!$D$9:$E$18,4,FALSE)","v":"2 Make & 2 Break"}]
[null,{"$f":"HLOOKUP(Database!$B$18,Database!$D$9:$E$18,5,FALSE)","v":"1 Make & 3 Break"},{"$f":"HLOOKUP(Database!$B$18,Database!$D$9:$E$18,5,FALSE)","v":"1 Make & 3 Break"},{"$f":"HLOOKUP(Database!$B$18,Database!$D$9:$E$18,5,FALSE)","v":"1 Make & 3 Break"}]
[null,{"$f":"HLOOKUP(Database!$B$18,Database!$D$9:$E$18,6,FALSE)","v":"4 Break"},{"$f":"HLOOKUP(Database!$B$18,Database!$D$9:$E$18,6,FALSE)","v":"4 Break"},{"$f":"HLOOKUP(Database!$B$18,Database!$D$9:$E$18,6,FALSE)","v":"4 Break"}]
[null,{"$f":"HLOOKUP(Database!$B$18,Database!$D$9:$E$18,7,FALSE)","v":"3 Make & 1 Cut Out Contact"},{"$f":"HLOOKUP(Database!$B$18,Database!$D$9:$E$18,7,FALSE)","v":"3 Make & 1 Cut Out Contact"},{"$f":"HLOOKUP(Database!$B$18,Database!$D$9:$E$18,7,FALSE)","v":"3 Make & 1 Cut Out Contact"}]
[null,{"$f":"HLOOKUP(Database!$B$18,Database!$D$9:$E$18,8,FALSE)","v":"2 Make, 1 Break & 1 Cut Out Contact"},{"$f":"HLOOKUP(Database!$B$18,Database!$D$9:$E$18,8,FALSE)","v":"2 Make, 1 Break & 1 Cut Out Contact"},{"$f":"HLOOKUP(Database!$B$18,Database!$D$9:$E$18,8,FALSE)","v":"2 Make, 1 Break & 1 Cut Out Contact"}]
[null,{"$f":"HLOOKUP(Database!$B$18,Database!$D$9:$E$18,9,FALSE)","v":"1 Make, 2 Break & 1 Cut Out Contact"},{"$f":"HLOOKUP(Database!$B$18,Database!$D$9:$E$18,9,FALSE)","v":"1 Make, 2 Break & 1 Cut Out Contact"},{"$f":"HLOOKUP(Database!$B$18,Database!$D$9:$E$18,9,FALSE)","v":"1 Make, 2 Break & 1 Cut Out Contact"}]
[null,{"$f":"HLOOKUP(Database!$B$18,Database!$D$9:$E$18,10,FALSE)","v":"3 Break & 1 Cut Out Contact"},{"$f":"HLOOKUP(Database!$B$18,Database!$D$9:$E$18,10,FALSE)","v":"3 Break & 1 Cut Out Contact"},{"$f":"HLOOKUP(Database!$B$18,Database!$D$9:$E$18,10,FALSE)","v":"3 Break & 1 Cut Out Contact"}]
[null,{"$f":"HLOOKUP(Database!$B$18,Database!$D$9:$E$28,11,FALSE)","v":"0016"},{"$f":"HLOOKUP(Database!$B$18,Database!$D$9:$E$28,11,FALSE)","v":"0016"},{"$f":"HLOOKUP(Database!$B$18,Database!$D$9:$E$28,11,FALSE)","v":"0016"}]
[null,{"$f":"HLOOKUP(Database!$B$18,Database!$D$9:$E$28,12,FALSE)","v":"0017"},{"$f":"HLOOKUP(Database!$B$18,Database!$D$9:$E$28,12,FALSE)","v":"0017"},{"$f":"HLOOKUP(Database!$B$18,Database!$D$9:$E$28,12,FALSE)","v":"0017"}]
[null,{"$f":"HLOOKUP(Database!$B$18,Database!$D$9:$E$28,13,FALSE)","v":"0018"},{"$f":"HLOOKUP(Database!$B$18,Database!$D$9:$E$28,13,FALSE)","v":"0018"},{"$f":"HLOOKUP(Database!$B$18,Database!$D$9:$E$28,13,FALSE)","v":"0018"}]
["Self Reset Contacts",{"$f":"HLOOKUP(Database!$B$18,Database!$D$9:$E$28,14,FALSE)","v":"0019"},{"$f":"HLOOKUP(Database!$B$18,Database!$D$9:$E$28,14,FALSE)","v":"0019"},{"$f":"HLOOKUP(Database!$B$18,Database!$D$9:$E$28,14,FALSE)","v":"0019"}]
[null,{"$f":"HLOOKUP(Database!$B$18,Database!$D$9:$E$28,15,FALSE)","v":"0020"},{"$f":"HLOOKUP(Database!$B$18,Database!$D$9:$E$28,15,FALSE)","v":"0020"},{"$f":"HLOOKUP(Database!$B$18,Database!$D$9:$E$28,15,FALSE)","v":"0020"}]
[null,{"$f":"HLOOKUP(Database!$B$18,Database!$D$9:$E$28,16,FALSE)","v":"0111"},{"$f":"HLOOKUP(Database!$B$18,Database!$D$9:$E$28,16,FALSE)","v":"0111"},{"$f":"HLOOKUP(Database!$B$18,Database!$D$9:$E$28,16,FALSE)","v":"0111"}]
[null,{"$f":"HLOOKUP(Database!$B$18,Database!$D$9:$E$28,17,FALSE)","v":"0112"},{"$f":"HLOOKUP(Database!$B$18,Database!$D$9:$E$28,17,FALSE)","v":"0112"},{"$f":"HLOOKUP(Database!$B$18,Database!$D$9:$E$28,17,FALSE)","v":"0112"}]
[null,{"$f":"HLOOKUP(Database!$B$18,Database!$D$9:$E$28,18,FALSE)","v":"0113"},{"$f":"HLOOKUP(Database!$B$18,Database!$D$9:$E$28,18,FALSE)","v":"0113"},{"$f":"HLOOKUP(Database!$B$18,Database!$D$9:$E$28,18,FALSE)","v":"0113"}]
[null,{"$f":"HLOOKUP(Database!$B$18,Database!$D$9:$E$28,19,FALSE)","v":"0114"},{"$f":"HLOOKUP(Database!$B$18,Database!$D$9:$E$28,19,FALSE)","v":"0114"},{"$f":"HLOOKUP(Database!$B$18,Database!$D$9:$E$28,19,FALSE)","v":"0114"}]
[null,{"$f":"HLOOKUP(Database!$B$18,Database!$D$9:$E$37,20,FALSE)","v":"2 Make"},{"$f":"HLOOKUP(Database!$B$18,Database!$D$9:$E$37,20,FALSE)","v":"2 Make"},{"$f":"HLOOKUP(Database!$B$18,Database!$D$9:$E$37,20,FALSE)","v":"2 Make"}]
[null,{"$f":"HLOOKUP(Database!$B$18,Database!$D$9:$E$37,21,FALSE)","v":"1 Make & 1 Break"},{"$f":"HLOOKUP(Database!$B$18,Database!$D$9:$E$37,21,FALSE)","v":"1 Make & 1 Break"},{"$f":"HLOOKUP(Database!$B$18,Database!$D$9:$E$37,21,FALSE)","v":"1 Make & 1 Break"}]
[null,{"$f":"HLOOKUP(Database!$B$18,Database!$D$9:$E$37,22,FALSE)","v":"2 Break"},{"$f":"HLOOKUP(Database!$B$18,Database!$D$9:$E$37,22,FALSE)","v":"2 Break"},{"$f":"HLOOKUP(Database!$B$18,Database!$D$9:$E$37,22,FALSE)","v":"2 Break"}]
[null,{"$f":"HLOOKUP(Database!$B$18,Database!$D$9:$E$37,23,FALSE)","v":" "},{"$f":"HLOOKUP(Database!$B$18,Database!$D$9:$E$37,23,FALSE)","v":" "},{"$f":"HLOOKUP(Database!$B$18,Database!$D$9:$E$37,23,FALSE)","v":" "}]
["Flag Type",{"$f":"HLOOKUP(Database!$B$18,Database!$D$9:$E$37,24,FALSE)","v":" "},{"$f":"HLOOKUP(Database!$B$18,Database!$D$9:$E$37,24,FALSE)","v":" "},{"$f":"HLOOKUP(Database!$B$18,Database!$D$9:$E$37,24,FALSE)","v":" "}]
[null,{"$f":"HLOOKUP(Database!$B$18,Database!$D$9:$E$37,25,FALSE)","v":"0000"},{"$f":"HLOOKUP(Database!$B$18,Database!$D$9:$E$37,25,FALSE)","v":"0000"},{"$f":"HLOOKUP(Database!$B$18,Database!$D$9:$E$37,25,FALSE)","v":"0000"}]
["Design Suffix",{"$f":"HLOOKUP(Database!$B$18,Database!$D$9:$E$37,26,FALSE)","v":"0005"},{"$f":"HLOOKUP(Database!$B$18,Database!$D$9:$E$37,26,FALSE)","v":"0005"},{"$f":"HLOOKUP(Database!$B$18,Database!$D$9:$E$37,26,FALSE)","v":"0005"}]
["Time Ranges",{"$f":"HLOOKUP(Database!$B$18,Database!$D$9:$E$37,27,FALSE)","v":"0010"},{"$f":"HLOOKUP(Database!$B$18,Database!$D$9:$E$37,27,FALSE)","v":"0010"},{"$f":"HLOOKUP(Database!$B$18,Database!$D$9:$E$37,27,FALSE)","v":"0010"}]
[null,{"$f":"HLOOKUP(Database!$B$18,Database!$D$9:$E$37,28,FALSE)","v":"0010"},{"$f":"HLOOKUP(Database!$B$18,Database!$D$9:$E$37,28,FALSE)","v":"0010"},{"$f":"HLOOKUP(Database!$B$18,Database!$D$9:$E$37,28,FALSE)","v":"0010"}]
[null,{"$f":"HLOOKUP(Database!$B$18,Database!$D$9:$E$37,29,FALSE)","v":"0010"},{"$f":"HLOOKUP(Database!$B$18,Database!$D$9:$E$37,29,FALSE)","v":"0010"},{"$f":"HLOOKUP(Database!$B$18,Database!$D$9:$E$37,29,FALSE)","v":"0010"}]
[null,"With Hand Reset Flag","With Hand Reset Flag","With Hand Reset Flag"]
[null,"B","B","B"]
[null,"C","C","C"]
[null,{"$f":"VLOOKUP(Database!$C$1,Database!$D$1:$U$5,13,FALSE)","v":" "},{"$f":"VLOOKUP(Database!$C$1,Database!$D$1:$U$5,13,FALSE)","v":" "},{"$f":"VLOOKUP(Database!$C$1,Database!$D$1:$U$5,13,FALSE)","v":" "}]
[null,{"$f":"VLOOKUP(Database!$C$1,Database!$D$1:$U$5,14,FALSE)","v":" "},{"$f":"VLOOKUP(Database!$C$1,Database!$D$1:$U$5,14,FALSE)","v":" "},{"$f":"VLOOKUP(Database!$C$1,Database!$D$1:$U$5,14,FALSE)","v":" "}]
[null,{"$f":"VLOOKUP(Database!$C$1,Database!$D$1:$U$5,15,FALSE)","v":" "},{"$f":"VLOOKUP(Database!$C$1,Database!$D$1:$U$5,15,FALSE)","v":" "},{"$f":"VLOOKUP(Database!$C$1,Database!$D$1:$U$5,15,FALSE)","v":" "}]
[null,{"$f":"VLOOKUP(Database!$C$1,Database!$D$1:$U$5,16,FALSE)","v":"C"},{"$f":"VLOOKUP(Database!$C$1,Database!$D$1:$U$5,16,FALSE)","v":"C"},{"$f":"VLOOKUP(Database!$C$1,Database!$D$1:$U$5,16,FALSE)","v":"C"}]
[null,{"$f":"VLOOKUP(Database!$C$1,Database!$D$1:$U$5,17,FALSE)","v":"C"},{"$f":"VLOOKUP(Database!$C$1,Database!$D$1:$U$5,17,FALSE)","v":"C"},{"$f":"VLOOKUP(Database!$C$1,Database!$D$1:$U$5,17,FALSE)","v":"C"}]
[null,{"$f":"VLOOKUP(Database!$C$1,Database!$D$1:$U$5,18,FALSE)","v":"C"},{"$f":"VLOOKUP(Database!$C$1,Database!$D$1:$U$5,18,FALSE)","v":"C"},{"$f":"VLOOKUP(Database!$C$1,Database!$D$1:$U$5,18,FALSE)","v":"C"}]
["Case","J","R","R"]

{"sheet":"Routing","index":8,"n_rows":42,"n_cols":6,"rows_kept":42,"cut":false,"hidden":true,"merged":[]}
[]
[null,"Model No:",{"$f":"BOM!A3","v":"MVAA12R1BA0016C"}]
[null,"Ref Op Set: "]
[null,"Pre-production Ref Op. Set: "]
[null,{"$f":"VLOOKUP('Routing DB'!$B$26,'Routing DB'!$A$29:$C$38,3,FALSE)","v":{"$error":"#REF!"}}]
[]
[null,"105B","Assembly & Wire",{"$f":"VLOOKUP('Routing DB'!$G$1,'Routing DB'!$F$3:$G$93,2,FALSE)","v":{"$error":"#REF!"}},"Mins"]
[null,"105B","Product Check",6.5,"Mins","doesn't change"]
[null,"105B","Prep for Test",{"$f":"VLOOKUP('Routing DB'!$B$1,'Routing DB'!$A$4:$B$5,2,FALSE)","v":{"$error":"#N/A"}},"Mins"]
[null,"105D",{"$f":"VLOOKUP('Routing DB'!$B$26,'Routing DB'!$A$29:$D$38,4,FALSE)","v":{"$error":"#REF!"}},{"$f":"VLOOKUP('Routing DB'!$B$26,'Routing DB'!$A$29:$B$38,2,FALSE)","v":{"$error":"#REF!"}},"Mins"]
[null,"105D","Auto Test",{"$f":"VLOOKUP('Routing DB'!$B$11,'Routing DB'!$A$14:$B$24,2,FALSE)","v":2.8},"Mins"]
[null,"106B","Nameplate Printing",{"$f":"VLOOKUP('Routing DB'!$B$1,'Routing DB'!$A$8:$B$9,2,FALSE)","v":{"$error":"#N/A"}},"Mins"]
[]
["Ass&Wire"]
["4 Std Contacts",null,14.6]
["4 BBM or 4 MBB",null,16.899999999999999]
["6 Std Contacts",null,16.899999999999999]
["8 Std Contacts",null,55.2]
["1 Std & 3 BOM",null,14.6]
["3 Std & 2 BOM",null,15.8]
["4 Std & 4 BOM",null,55.2]
["2 Std & 6 BOM",null,55.2]
["6 BBM",null,59.8]
[]
["Prep 4 Test"]
["Single Stack",null,5.2]
["Double Stack",null,10.3]
[]
["Flash Test"]
["0 BOM Contacts",null,0]
["2 BOM Contacts",null,3.5]
["3 BOM Contacts",null,4]
["4 BOM Contacts",null,4.5]
["6 BOM Contacts",null,5.5]
[]
["Auto Test"]
["Without Flag",null,1.9]
["With Flag",null,2.8]
[]
["Nameplate Printing"]
["Single Stack",null,0.6]
["Double Stack",null,1.2]

{"sheet":"Routing DB","index":9,"n_rows":93,"n_cols":7,"rows_kept":93,"cut":false,"hidden":true,"merged":[]}
["Case Size",{"$f":"Configurator!$D$6","v":"R"},null,null,null,"Contact Numbering",{"$f":"Database!#REF!","v":{"$error":"#REF!"}}]
[]
["Prep for Test",null,null,null,null,"Assembly & Wire"]
["J",5.2,null,null,null,11,14.6]
["L",10.3,null,null,null,12,14.6]
[null,null,null,null,null,13,14.6]
["Nameplate Print",null,null,null,null,14,14.6]
["J",0.6,null,null,null,15,14.6]
["L",1.2,null,null,null,16,16.899999999999999]
[null,null,null,null,null,17,16.899999999999999]
["Flag Type",{"$f":"Configurator!$F$6","v":"B"},null,null,null,31,16.899999999999999]
[null,null,null,null,null,32,16.899999999999999]
["Auto Test",null,null,null,null,33,16.899999999999999]
["A",1.9,null,null,null,34,16.899999999999999]
["B",2.8,null,null,null,35,16.899999999999999]
["C",2.8,null,null,null,36,16.899999999999999]
["D",2.8,null,null,null,37,16.899999999999999]
["E",2.8,null,null,null,51,59.8]
["F",2.8,null,null,null,53,55.2]
["J",1.9,null,null,null,54,55.2]
["K",2.8,null,null,null,55,55.2]
["L",2.8,null,null,null,56,55.2]
["M",2.8,null,null,null,57,55.2]
["N",2.8,null,null,null,58,55.2]
[null,null,null,null,null,59,55.2]
["Number of Heavy Duty Contacts",{"$f":"IF(Database!#REF!=\"None or 4 Heavy Duty Required\",VLOOKUP(Database!#REF!,Database!#REF!,2,FALSE),Database!#REF!)","v":{"$error":"#REF!"}},null,null,null,60,55.2]
[null,null,null,null,null,61,55.2]
["Flash Test",null,null,null,null,101,14.6]
["4 Make Heavy Duty",4.5," ","Flash Test 4BOM",null,102,14.6]
["3 Make & 1 Break Heavy Duty",4.5," ","Flash Test 4BOM",null,103,14.6]
["2 Make & 2 Break Heavy Duty",4.5," ","Flash Test 4BOM",null,104,14.6]
["1 Make & 3 Break Heavy Duty",4.5," ","Flash Test 4BOM",null,105,14.6]
["4 Break Heavy Duty",4.5," ","Flash Test 4BOM",null,106,14.6]
["None Required",0,"Delete Flash Test","Flash Test",null,107,14.6]
["3 Heavy Duty Required",4," ","Flash Test 3BOM",null,108,14.6]
["2 Heavy Duty Required",3.5," ","Flash Test 2BOM",null,109,15.8]
["6 Heavy Duty Required",5.5," ","Flash Test 6BOM",null,110,15.8]
["Not Available",0,"Delete Flash Test","Flash Test",null,111,15.8]
[null,null,null,null,null,112,15.8]
[null,null,null,null,null,113,15.8]
[null,null,null,null,null,114,15.8]
[null,null,null,null,null,115,15.8]
[null,null,null,null,null,116,15.8]
[null,null,null,null,null,117,15.8]
[null,null,null,null,null,118,15.8]
[null,null,null,null,null,119,15.8]
[null,null,null,null,null,120,15.8]
[null,null,null,null,null,151,55.2]
[null,null,null,null,null,152,55.2]
[null,null,null,null,null,153,55.2]
[null,null,null,null,null,154,55.2]
[null,null,null,null,null,155,55.2]
[null,null,null,null,null,156,55.2]
[null,null,null,null,null,157,55.2]
[null,null,null,null,null,158,55.2]
[null,null,null,null,null,159,55.2]
[null,null,null,null,null,160,55.2]
[null,null,null,null,null,161,55.2]
[null,null,null,null,null,162,55.2]
[null,null,null,null,null,163,55.2]
[null,null,null,null,null,164,55.2]
[null,null,null,null,null,165,55.2]
[null,null,null,null,null,166,55.2]
[null,null,null,null,null,167,55.2]
[null,null,null,null,null,168,55.2]
[null,null,null,null,null,169,55.2]
[null,null,null,null,null,170,55.2]
[null,null,null,null,null,171,55.2]
[null,null,null,null,null,172,55.2]
[null,null,null,null,null,173,55.2]
[null,null,null,null,null,174,55.2]
[null,null,null,null,null,175,55.2]
[null,null,null,null,null,176,55.2]
[null,null,null,null,null,177,55.2]
[null,null,null,null,null,178,55.2]
[null,null,null,null,null,179,55.2]
[null,null,null,null,null,180,55.2]
[null,null,null,null,null,181,55.2]
[null,null,null,null,null,182,55.2]
[null,null,null,null,null,183,55.2]
[null,null,null,null,null,184,55.2]
[null,null,null,null,null,185,55.2]
[null,null,null,null,null,186,55.2]
[null,null,null,null,null,187,55.2]
[null,null,null,null,null,188,55.2]
[null,null,null,null,null,189,55.2]
[null,null,null,null,null,190,55.2]
[null,null,null,null,null,191,55.2]
[null,null,null,null,null,192,55.2]
[null,null,null,null,null,193,55.2]
[null,null,null,null,null,194,55.2]
[null,null,null,null,null,195,55.2]
[null,null,null,null,null,196,55.2]